Silylidyne anion
- Formula: HSi-
- Molecular weight: 29.0940
- CAS Registry Number: 68865-96-3

Reaction thermochemistry data

Data compiled by: John E. Bartmess
Individual Reactions
By formula: (HSi- • 4294967295Si) + Si = HSi-
Quantity | Value | Units | Method | Reference | Comment |
---|---|---|---|---|---|
ΔrH° | 350. ± 13. | kJ/mol | N/A | Kasdan, Herbst, et al., 1975 | gas phase |

Ion clustering data

Data compiled by: John E. Bartmess
Clustering reactions
By formula: (HSi- • 4294967295Si) + Si = HSi-
Quantity | Value | Units | Method | Reference | Comment |
---|---|---|---|---|---|
ΔrH° | 350. ± 13. | kJ/mol | N/A | Kasdan, Herbst, et al., 1975 | gas phase |

References

Kasdan, Herbst, et al., 1975
Kasdan, A.; Herbst, E.; Lineberger, W.C.,
Laser photoelectron spectrometry of the negative ions of silicon and its hydrides,
J. Chem. Phys., 1975, 62, 541. [all data]