1-pentene, 3-chloro-, (.+-.)-
- Formula: C5H9Cl
- Molecular weight: 104.578
- IUPAC Standard InChIKey: GEVKGFRTXNJNKK-UHFFFAOYSA-N
- CAS Registry Number: 68703-27-5
- Chemical structure:
View 3d structure (requires JavaScript / HTML 5) - Species with the same structure:

Phase change data

Data compiled by: Thermodynamics Research Center, NIST Boulder Laboratories, Chris Muzny director
Quantity | Value | Units | Method | Reference | Comment |
---|---|---|---|---|---|
Tboil | 379.65 | K | N/A | Lauer and Benton, 1959 | Uncertainty assigned by TRC = 5. K |

References

Lauer and Benton, 1959
Lauer; Benton,
J. Org. Chem., 1959, 24, 804. [all data]