1-Octanol, 3,7-dimethyl-, (S)-
- Formula: C10H22O
- Molecular weight: 158.2811
- IUPAC Standard InChIKey: PRNCMAKCNVRZFX-SNVBAGLBSA-N
- CAS Registry Number: 68680-98-8
- Chemical structure:
View 3d structure (requires JavaScript / HTML 5) - Stereoisomers:
- Other names: (-)-3,7-Dimethyl-1-octanol; (S)-3,7-Dimethyl-1-octanol; (S)-Dihydrocitronellol

Phase change data

Data compiled by: Robert L. Brown and Stephen E. Stein
Reduced pressure boiling point
Tboil (K) | Pressure (bar) | Reference |
---|---|---|
378. to 379. | 0.020 | Frinton Laboratories Inc., 1986 |

References

Frinton Laboratories Inc., 1986
Frinton Laboratories Inc.,
Catalog Number 11, Frinton Laboratories Inc., Vineland, NJ, 1986, 99. [all data]