1,1,1-Trifluoro-2,2,2-triphenylethane
- Formula: C20H15F3
- Molecular weight: 312.3283
- CAS Registry Number: 68643-31-2

Phase change data

Data compiled by: William E. Acree, Jr., James S. Chickos
Quantity | Value | Units | Method | Reference | Comment |
---|---|---|---|---|---|
ΔsubH° | 112.3 ± 1.0 | kJ/mol | N/A | Schaffer, Verevkin, et al., 1997 |
Enthalpy of fusion
ΔfusH (kJ/mol) | Temperature (K) | Reference |
---|---|---|
30.33 | 440.3 | Schaffer, Verevkin, et al., 1997 |

References

Schaffer, Verevkin, et al., 1997
Schaffer, F.; Verevkin, S.P.; Rieger, H.J.; Beckhaus, H.D.; Ruchardt, C.,
Enthalpies of formation of a series of fluorinated hydrocarbons and strain-free group increments to assess polar and anomeric stabilization and strain,
Liebigs Ann., 1997, 1333-1344. [all data]