Pyrene-pyromellitic dianhydride charge transfer complex

Condensed phase thermochemistry data

Data compiled by: Eugene S. Domalski and Elizabeth D. Hearing

Quantity Value Units Method Reference Comment
solid,1 bar464.8J/mol*KN/ABoerio-Goates and Westrum, 1980
solid,1 bar464.6J/mol*KN/ADunn, Rahman, et al., 1978

Constant pressure heat capacity of solid

Cp,solid (J/mol*K) Temperature (K) Reference Comment
446.4298.15Boerio-Goates and Westrum, 1980T = 5 to 300 K.
435.9298.15Dunn, Rahman, et al., 1978T = 5 to 300 K.

References

Boerio-Goates and Westrum, 1980
Boerio-Goates, J.; Westrum, E.F., Jr., Thermodynamic studies of orientational disorder in p-molecular compounds. III. Heat capacities of naphthalene-pyromellitic dianhydride and pyrene-pyromellitic dianhydride, Mol. Cryst. Liq. Cryst., 1980, 60, 249-266. [all data]

Dunn, Rahman, et al., 1978
Dunn, A.G.; Rahman, A.; Staveley, L.A.K., The heat capacity of pyromellitic dianhydride and of its 1-1 charge-transfer complex with pyrene, J. Chem. Thermodynam., 1978, 10, 787-796. [all data]