Di-sec-Butyl ether

Condensed phase thermochemistry data

Data compiled by: Hussein Y. Afeefy, Joel F. Liebman, and Stephen E. Stein

Quantity Value Units Method Reference Comment
Δfliquid-401.6 ± 1.1kJ/molCcbColomina, Pell, et al., 1965
Quantity Value Units Method Reference Comment
Δcliquid-5319.0 ± 1.0kJ/molCcbColomina, Pell, et al., 1965Corresponding Δfliquid = -401.5 kJ/mol (simple calculation by NIST; no Washburn corrections)

Gas phase thermochemistry data

Data compiled by: Hussein Y. Afeefy, Joel F. Liebman, and Stephen E. Stein

Quantity Value Units Method Reference Comment
Δfgas-86.3 ± 0.5kcal/molCcbColomina, Pell, et al., 1965

Phase change data

Data compiled as indicated in comments:
BS - Robert L. Brown and Stephen E. Stein

Quantity Value Units Method Reference Comment
Tboil394.KN/AAmerican Tokyo Kasei, 1988BS
Tboil394.2KN/AMajer and Svoboda, 1985
Quantity Value Units Method Reference Comment
Δvap9.771kcal/molN/AMajer and Svoboda, 1985

Enthalpy of vaporization

ΔvapH (kcal/mol) Temperature (K) Reference Comment
8.141394.2Majer and Svoboda, 1985

Gas phase ion energetics data

Data evaluated as indicated in comments:
HL - Edward P. Hunter and Sharon G. Lias

Data compiled as indicated in comments:
LLK - Sharon G. Lias, Rhoda D. Levin, and Sherif A. Kafafi

Quantity Value Units Method Reference Comment
Proton affinity (review)207.0kcal/molN/AHunter and Lias, 1998HL
Quantity Value Units Method Reference Comment
Gas basicity200.4kcal/molN/AHunter and Lias, 1998HL

Ionization energy determinations

IE (eV) Method Reference Comment
9.11EIHolmes, Fingas, et al., 1981LLK

References

Colomina, Pell, et al., 1965
Colomina, M.; Pell, A.S.; Skinner, H.A.; Coleman, D.J., Heats of combustion of four dialkylethers, Trans. Faraday Soc., 1965, 61, 2641. [all data]