Norepinephrine, (R)-, 4TMS derivative

Kovats' RI, non-polar column, isothermal

View large format table.

Column type Active phase Temperature (C) I Reference Comment
PackedOV-1190.1960.Cashaw, Walsh, et al., 1971N2, GasChrom Q; Column length: 2. m

Van Den Dool and Kratz RI, non-polar column, temperature ramp

View large format table.

Column type Active phase I Reference Comment
PackedOV-11949.Butts, 1972He, Chromosorb W HP (80-100 mesh), 10. K/min; Column length: 2. m; Tstart: 100. C; Tend: 325. C

References

Cashaw, Walsh, et al., 1971
Cashaw, J.L.; Walsh, M.J.; Yamanaka, Y.; Davis, V.E., Simultaneous determination of biogenic amines and narcotic alkaloids by gas-liquid chromatography, J. Chromatogr. Sci., 1971, 9, 2, 98-104, https://doi.org/10.1093/chromsci/9.2.98 . [all data]

Butts, 1972
Butts, W.C., Two-Column Gas Chromatography of Trimethylsilyl Derivatives of Biochemically Significant Compounds, Anal. Biochemistry, 1972, 46, 1, 187-199, https://doi.org/10.1016/0003-2697(72)90411-3 . [all data]