octadecanoic acid, 2,3-dibromo-

Phase change data

Data compiled by: Thermodynamics Research Center, NIST Boulder Laboratories, Chris Muzny director

Quantity Value Units Method Reference Comment
Tfus345.KN/AMyers, 1951Uncertainty assigned by TRC = 2. K
Tfus330.3KN/AMyers, 1951Uncertainty assigned by TRC = 0.5 K

In addition to the Thermodynamics Research Center (TRC) data available from this site, much more physical and chemical property data is available from the following TRC products:

References

Myers, 1951
Myers, G.S., 2-Octadecenoic Acid I> Preparation and SOme Reactions of the cis and trans Isomers, J. Am. Chem. Soc., 1951, 73, 2100-4. [all data]