Acetamide, 2,2,2-trifluoro-N-methyl-N-(trifluoroacetyl)-
- Formula: C5H3F6NO2
- Molecular weight: 223.0732
- IUPAC Standard InChIKey: AWGBWLXGUPTXHF-UHFFFAOYSA-N
- CAS Registry Number: 685-27-8
- Chemical structure:
View 3d structure (requires JavaScript / HTML 5) - Other names: N-Methylbis(trifluoroacetamide); 2,2,2-trifluoro-N-methyl-N-(trifluoroacetyl)acetamide

Normal alkane RI, non-polar column, custom temperature program

Column type | Active phase | I | Reference | Comment |
---|---|---|---|---|
Capillary | Polydimethyl siloxanes | 773. | Zenkevich, 2001 | Program: not specified |

References

Zenkevich, 2001
Zenkevich, I.G.,
Encyclopedia of Chromatography. Derivatization of Amines, Amino Acids, Amides and Imides for GC Analysis, Marcel Dekker, Inc, New York - Basel, 2001, 224. [all data]