Silane, dimethoxydiphenyl-
- Formula: C14H16O2Si
- Molecular weight: 244.3611
- IUPAC Standard InChIKey: AHUXYBVKTIBBJW-UHFFFAOYSA-N
- CAS Registry Number: 6843-66-9
- Chemical structure:
View 3d structure (requires JavaScript / HTML 5) - Other names: Dimethoxydiphenylsilane; Diphenyldimethoxysilane; CD6010

Phase change data

Data compiled as indicated in comments:
BS - Robert L. Brown and Stephen E. Stein
AC - William E. Acree, Jr., James S. Chickos
Quantity | Value | Units | Method | Reference | Comment |
---|---|---|---|---|---|
ΔvapH° | 64.4 ± 0.9 | kJ/mol | C | Voronkov, Baryshok, et al., 1988 | AC |
Reduced pressure boiling point
Tboil (K) | Pressure (bar) | Reference | Comment |
---|---|---|---|
434. | 0.020 | PCR Inc., 1990 | BS |

References

Voronkov, Baryshok, et al., 1988
Voronkov, M.G.; Baryshok, V.P.; Klyuchnikov, V.A.; Danilova, T.F.; Pepekin, V.I.; Korchagina, A.N.; Khudobin, Yu.I.,
Thermochemistry of organosilicon compounds,
Journal of Organometallic Chemistry, 1988, 345, 1-2, 27-38, https://doi.org/10.1016/0022-328X(88)80231-6
. [all data]
PCR Inc., 1990
PCR Inc.,
Research Chemicals Catalog 1990-1991, PCR Inc., Gainesville, FL, 1990, 1. [all data]
Nagy and Hencsei, 1967
Nagy, J.; Hencsei, P.,
Investigations on the bond structure of alkylphenoxy-silanes using ultraviolet spectrophotometric methods,
J. Organomet. Chem., 1967, 9, 57-65. [all data]