Silane, trichloro(1,2-dichloroethyl)-

Phase change data

Data compiled as indicated in comments:
AC - William E. Acree, Jr., James S. Chickos

Enthalpy of vaporization

ΔvapH (kJ/mol) Temperature (K) Method Reference Comment
45.7390.IJenkins and Chambers, 1954Based on data from 375. - 453. K.; AC

Antoine Equation Parameters

log10(P) = A − (B / (T + C))
    P = vapor pressure (bar)
    T = temperature (K)

View plot Requires a JavaScript / HTML 5 canvas capable browser.

Temperature (K) A B C Reference
375.3 - 453.75.060492227.-13.Jenkins and Chambers, 1954

References

Jenkins and Chambers, 1954
Jenkins, Arthur C.; Chambers, George F., Vapor Pressures of Silicon Compounds, Ind. Eng. Chem., 1954, 46, 11, 2367-2369, https://doi.org/10.1021/ie50539a043 . [all data]