1,4-butanediol, 2-phenyl-
- Formula: C10H14O2
- Molecular weight: 166.2170
- IUPAC Standard InChIKey: BVDKYMGISZDCIY-UHFFFAOYSA-N
- CAS Registry Number: 6837-05-4
- Chemical structure:
View 3d structure (requires JavaScript / HTML 5) - Permanent link for this species. Use this link for bookmarking this species for future reference.

Phase change data

Data compiled by: Thermodynamics Research Center, NIST Boulder Laboratories, Chris Muzny director
Quantity | Value | Units | Method | Reference | Comment |
---|---|---|---|---|---|
Tfus | 342.65 | K | N/A | Saegebarth, 1962 | Uncertainty assigned by TRC = 1.5 K |

References

Saegebarth, 1962
Saegebarth, K.A.,
, 1962. [all data]