N-Methylpivalamide
- Formula: C6H13NO
- Molecular weight: 115.1735
- IUPAC Standard InChIKey: QMKKJBRRKIKWFK-UHFFFAOYSA-N
- CAS Registry Number: 6830-83-7
- Chemical structure:
View 3d structure (requires JavaScript / HTML 5) - Other names: N-Methyltrimethylacetamide; 2,2,N-Trimethylpropanamide

Condensed phase thermochemistry data

Data compiled by: Eugene S. Domalski and Elizabeth D. Hearing
Constant pressure heat capacity of solid
Cp,solid (J/mol*K) | Temperature (K) | Reference |
---|---|---|
183. | 298.15 | Konicek and Wadso, 1971 |

Phase change data

Data compiled by: Robert L. Brown and Stephen E. Stein
Reduced pressure boiling point
Tboil (K) | Pressure (bar) | Reference |
---|---|---|
378. to 383. | 0.020 | Frinton Laboratories Inc., 1986 |

Gas phase ion energetics data

Data compiled by: Michael M. Meot-Ner (Mautner)
Gas basicity at 298K
Gas basicity (review) (kJ/mol) | Reference | Comment |
---|---|---|
878. ± 5. | Witt and Grutzmacher, 1997 | p-Phenylenediamine; n-Propylamine. Data readjusted to Hunter and Lias, 1998 |

References

Konicek and Wadso, 1971
Konicek, J.; Wadso, I.,
Thermochemical properties of some carboxylic acids, amines and N-substituted amides in aqueous solution,
Acta Chem. Scand., 1971, 25, 1541-1551. [all data]
Frinton Laboratories Inc., 1986
Frinton Laboratories Inc.,
Catalog Number 11, Frinton Laboratories Inc., Vineland, NJ, 1986, 99. [all data]
Witt and Grutzmacher, 1997
Witt, M.; Grutzmacher, H.F.,
Proton-bound dimers of aliphatic carboxamides: gas-phase basicity and dissociation energy,
Int. J. Mass Spectrom. Ion Processes, 1997, 165, 49. [all data]
Hunter and Lias, 1998
Hunter, E.P.; Lias, S.G.,
Evaluated Gas Phase Basicities and Proton Affinities of Molecules: An Update,
J. Phys. Chem. Ref. Data, 1998, 27, 3, 413-656, https://doi.org/10.1063/1.556018
. [all data]