Methyl cholate, 3TMS derivative

Normal alkane RI, non-polar column, temperature ramp

View large format table.

Column type Active phase I Reference Comment
CapillaryCP Sil 5 CB3261.Batta, Aggarwal, et al., 1995He, 100. C @ 2. min, 35. K/min; Column length: 25. m; Column diameter: 0.22 mm; Tend: 278. C

Normal alkane RI, non-polar column, custom temperature program

View large format table.

Column type Active phase I Reference Comment
CapillaryMethyl Silicone3212.Meng, Reyes, et al., 1997Program: not specified
CapillaryMethyl Silicone3212.Meng and Sjövall, 199725. m/0.32 mm/0.25 μm; Program: 60 0C 30 K/min -> 210 0C (1.5 min) 2.5 K/min -> 320 0C (20 min)

References

Batta, Aggarwal, et al., 1995
Batta, A.K.; Aggarwal, S.K.; Tint, G.S.; Batta, M.; Salen, G., Capillary gas-liquid chromatography of 6-hydroxylated bile acids, J. Chromatogr. A, 1995, 704, 1, 228-233, https://doi.org/10.1016/0021-9673(95)00183-N . [all data]

Meng, Reyes, et al., 1997
Meng, L.-J.; Reyes, H.; Palma, J.; Hernandez, I.; Ribalta, J.; Sjövall, J., Profiles of bile acids and progesterone metabolites in the urine and serum of women with intrahepatic cholestasis of pregnancy, J. Hepatol., 1997, 27, 2, 346-357, https://doi.org/10.1016/S0168-8278(97)80181-X . [all data]

Meng and Sjövall, 1997
Meng, L.-J.; Sjövall, J., Method for combined analysis of profiles of conjugated progesterone metabolites and bile acids in serum and urine of pregnant women, J. Chromatogr. B, 1997, 688, 1, 11-26, https://doi.org/10.1016/S0378-4347(97)88051-6 . [all data]