2,2-Dimethylglutaric acid
- Formula: C7H12O4
- Molecular weight: 160.1678
- IUPAC Standard InChIKey: BTUDGPVTCYNYLK-UHFFFAOYSA-N
- CAS Registry Number: 681-57-2
- Chemical structure:
View 3d structure (requires JavaScript / HTML 5) - Other names: α,α-Dimethylglutaric acid; Pentanedioic acid, 2,2-dimethyl-

Phase change data

Data compiled by: Thermodynamics Research Center, NIST Boulder Laboratories, Chris Muzny director
Quantity | Value | Units | Method | Reference | Comment |
---|---|---|---|---|---|
Tfus | 413. | K | N/A | Allinger, 1959 | Uncertainty assigned by TRC = 2. K |

References

Allinger, 1959
Allinger, N.L.,
The Relative Stabilities of cis and trans Isomers. IV The 3,5-Dimethylcycloheptanones,
J. Am. Chem. Soc., 1959, 81, 232-6. [all data]