Selina-3,7(11)-diene
- Formula: C15H24
- Molecular weight: 204.3511
- IUPAC Standard InChIKey: WNRBYZQFEBIUGD-CABCVRRESA-N
- CAS Registry Number: 6813-21-4
- Chemical structure:
View 3d structure (requires JavaScript / HTML 5) - Other names: Naphthalene, 1,2,3,4,4a,5,6,8a-octahydro-4a,8-dimethyl-2-(1-methylethylidene)-, (4aR-trans)-; Eudesma-3,7(11)-diene; 4a,8-Dimethyl-2-(1-methylethylidene)-1,2,3,4,4a,5,6,8a-octahydronaphthalene-, (4aR-trans)-; 3,7(11)-Selinadiene; (4aR,8aR)-4a,8-Dimethyl-2-(propan-2-ylidene)-1,2,3,4,4a,5,6,8a-octahydronaphthalene; Selina-3,7(11)-dien

Kovats' RI, non-polar column, temperature ramp

Column type | Active phase | I | Reference | Comment |
---|---|---|---|---|
Capillary | DB-5MS | 1545. | Maia, Andrade, et al., 2005 | 30. m/0.25 mm/0.25 μm, He, 3. K/min; Tstart: 60. C; Tend: 240. C |
Capillary | HP-5MS | 1532. | Siani, Garrido, et al., 2004 | 30. m/0.32 mm/0.25 μm, He, 70. C @ 5. min, 3. K/min; Tend: 250. C |
Capillary | HP-5 | 1542. | Tzakou and Couladis, 2001 | 30. m/0.25 mm/0.25 μm, He, 3. K/min; Tstart: 60. C; Tend: 280. C |
Capillary | HP-5MS | 1542. | Roussis, Tsoukatou, et al., 2000 | 30. m/0.25 mm/0.25 μm, He, 3. K/min; Tstart: 60. C; Tend: 280. C |
Capillary | HP-5MS | 1538. | Siani, Ramos, et al., 1999 | 30. m/0.32 mm/0.25 μm, He, 70. C @ 5. min, 3. K/min; Tend: 250. C |

Kovats' RI, non-polar column, custom temperature program

Column type | Active phase | I | Reference | Comment |
---|---|---|---|---|
Capillary | DB-5 | 1527. | Araújo, Silveira, et al., 2003 | 30. m/0.25 mm/0.25 μm, He; Program: 35C => 4C/min => 180C => 20C/min => 280C |
Capillary | DB-5MS | 1542. | Maia, Andrade, et al., 2000 | 30. m/0.25 mm/0.25 μm, He; Program: 40C => 2C/min => 60C => 4C/min => 260C |

Kovats' RI, polar column, temperature ramp

Column type | Active phase | I | Reference | Comment |
---|---|---|---|---|
Capillary | Supelcowax-10 | 1789. | Tzakou and Couladis, 2001 | 30. m/0.32 mm/0.25 μm, He, 3. K/min; Tstart: 75. C; Tend: 230. C |

Van Den Dool and Kratz RI, non-polar column, temperature ramp

Column type | Active phase | I | Reference | Comment |
---|---|---|---|---|
Capillary | DB-5 | 1542. | Flamini, Cioni, et al., 2007 | 30. m/0.25 mm/0.25 μm, He, 3. K/min; Tstart: 60. C; Tend: 240. C |
Capillary | Methyl Silicone | 1535. | Melo, Corrêa, et al., 2007 | 30. m/0.25 mm/0.25 μm, He, 2. K/min, 220. C @ 15. min; Tstart: 80. C |
Capillary | BP-1 | 1533. | Duquesnoy, Dinh, et al., 2006 | 50. m/0.22 mm/0.25 μm, He, 2. K/min, 220. C @ 20. min; Tstart: 60. C |
Capillary | HP-5 | 1544. | Flamini, Tebano, et al., 2006 | 30. m/0.25 mm/0.25 μm, N2, 60. C @ 10. min, 5. K/min; Tend: 220. C |
Capillary | BP-1 | 1540. | Gonny, Cavaleiro, et al., 2006 | 50. m/0.22 mm/0.25 μm, He, 2. K/min, 220. C @ 20. min; Tstart: 60. C |
Capillary | HP-5 | 1543. | Flamini, Luigi Cioni, et al., 2005 | 30. m/0.25 mm/0.25 μm, N2, 60. C @ 10. min, 5. K/min; Tend: 220. C |
Capillary | BP-1 | 1540. | Vellutini, Baldovini, et al., 2005 | 50. m/0.22 mm/0.25 μm, He, 2. K/min, 230. C @ 35. min; Tstart: 60. C |
Capillary | HP-5 | 1544. | Flamini, Luigi Cioni, et al., 2004 | 30. m/0.25 mm/0.25 μm, N2, 60. C @ 10. min, 5. K/min; Tend: 220. C |
Capillary | CP Sil 5 CB | 1530. | Pino, Marbot, et al., 2001 | 50. m/0.32 mm/0.4 μm, He, 60. C @ 10. min, 3. K/min, 280. C @ 60. min |

Van Den Dool and Kratz RI, non-polar column, custom temperature program

Column type | Active phase | I | Reference | Comment |
---|---|---|---|---|
Capillary | HP-5MS | 1550.5 | Andriamaharavo, 2014 | 30. m/0.25 mm/0.25 μm, He; Program: 60C (1 min) => 5 C/min => 210C => 10 C/min => 280C (15 min) |
Capillary | BPX-5 | 1539. | Cardeal, da Silva, et al., 2006 | 30. m/0.25 mm/0.25 μm; Program: 35C(5min) => 3C/min => 210C => 40C/min => 240C (4min) |

Van Den Dool and Kratz RI, polar column, temperature ramp

Column type | Active phase | I | Reference | Comment |
---|---|---|---|---|
Capillary | BP-20 | 1778. | Gonny, Cavaleiro, et al., 2006 | 50. m/0.22 mm/0.25 μm, He, 2. K/min, 220. C @ 20. min; Tstart: 60. C |
Capillary | AT-Wax | 1760. | Pino, Marbot, et al., 2001 | 60. m/0.32 mm/0.25 μm, He, 65. C @ 10. min, 2. K/min, 250. C @ 60. min |

Normal alkane RI, non-polar column, temperature ramp

Column type | Active phase | I | Reference | Comment |
---|---|---|---|---|
Capillary | DB-5 | 1546. | Rodriques, Amorim, et al., 2013 | 30. m/0.25 mm/0.25 μm, Helium, 3. K/min; Tstart: 60. C; Tend: 240. C |
Capillary | HP-5 MS | 1538. | Sardashti, Valizadeh, et al., 2013 | 60. m/0.25 mm/0.25 μm, Helium, 40. C @ 1. min, 3. K/min, 250. C @ 20. min |
Capillary | DB-5 | 1547. | Ho, Wang, et al., 2010 | 30. m/0.25 mm/0.25 μm, Helium, 2. K/min; Tstart: 50. C; Tend: 250. C |
Capillary | DB-5 | 1523. | de Souza, Lopes, et al., 2010 | 30. m/0.25 mm/0.25 μm, Helium, 40. C @ 1. min, 3. K/min; Tend: 240. C |
Capillary | DB-1-MS | 1531. | Takeoka, Hobbs, et al., 2010 | 60. m/0.25 mm/0.25 μm, Helium, 30. C @ 4. min, 2. K/min, 200. C @ 35. min |
Capillary | DB-1 | 1518. | Xu, Tang, et al., 2010 | 30. m/0.25 mm/0.25 μm, Helium, 50. C @ 2. min, 4. K/min, 220. C @ 2. min |
Capillary | 5 % Phenyl methyl siloxane | 1548. | Retta, Gattuso, et al., 2009 | 60. m/0.25 mm/0.25 μm, Helium, 3. K/min, 225. C @ 3. min; Tstart: 90. C |
Capillary | DB-5 | 1547. | Scrivanti, Anton, et al., 2009 | 30. m/0.25 mm/0.25 μm, Nitrogen, 2. K/min; Tstart: 40. C; Tend: 230. C |
Capillary | DB-5 | 1523. | de Souza, Lopes, et al., 2009 | 30. m/0.25 mm/0.25 μm, Helium, 40. C @ 1. min, 3. K/min; Tend: 240. C |
Capillary | HP-5 | 1543. | Yassa and Akhani, 2008 | 30. m/0.25 mm/0.32 μm, Helium, 60. C @ 30. min, 5. K/min; Tend: 250. C |
Capillary | HP-5 MS | 1545. | Adams, Beauchamp, et al., 2007 | 30. m/0.25 mm/0.25 μm, Helium, 50. C @ 10. min, 3. K/min, 230. C @ 10. min |
Capillary | DB-5 | 1544. | El-Ghorab A., El-Massry K.F., et al., 2007 | 30. m/0.25 mm/0.25 μm, He, 3. K/min, 220. C @ 40. min; Tstart: 35. C |
Capillary | ZB-5 | 1546. | Mohottalage, Tabacchi, et al., 2007 | 30. m/0.25 mm/0.25 μm, 60. C @ 5. min, 4. K/min, 220. C @ 20. min |
Capillary | HP-5 | 1543. | Yassa and Akhani, 2007 | 30. m/0.25 mm/0.32 μm, He, 60. C @ 30. min, 5. K/min; Tend: 250. C |
Capillary | BP-1 | 1542. | Boti, Yao, et al., 2006 | 50. m/0.22 mm/0.25 μm, 2. K/min, 220. C @ 20. min; Tstart: 60. C |
Capillary | DB-5 | 1540. | Pino, Marbot, et al., 2006 | 30. m/0.25 mm/0.25 μm, Hydrogen, 70. C @ 4. min, 4. K/min; Tend: 280. C |
Capillary | CP Sil 8 CB | 1562. | Facey, Porter, et al., 2005 | 30. m/0.25 mm/0.25 μm, He, 80. C @ 5. min, 3. K/min, 200. C @ 5. min |
Capillary | DB-5 | 1543. | Ferraz, Limberger, et al., 2005 | 30. m/0.25 mm/0.25 μm, He, 60. C @ 3. min, 3. K/min; Tend: 300. C |
Capillary | HP-5MS | 1540. | Ghasemi Y., Faridi P., et al., 2005 | He, 50. C @ 3. min, 3. K/min, 250. C @ 10. min; Column length: 25. m; Column diameter: 0.25 mm |
Capillary | HP-5MS | 1537. | Grombone-Guaratini, Silva-Brandão, et al., 2005 | 30. m/0.25 mm/0.25 μm, He, 3. K/min; Tstart: 60. C; Tend: 300. C |
Capillary | NB-30 | 1540. | Raal, Paaver, et al., 2004 | 50. m/0.20 mm/0.25 μm, He, 2. K/min; Tstart: 50. C; Tend: 250. C |
Capillary | DB-5 | 1537. | Tellez, Khan, et al., 2004 | 30. m/0.25 mm/0.25 μm, He, 3. K/min; Tstart: 60. C; Tend: 240. C |
Capillary | DB-5 | 1542. | Morteza-Semnani and Saeedi, 2003 | 30. m/0.25 mm/0.25 μm, He, 60. C @ 5. min, 4. K/min; Tend: 275. C |
Capillary | DB-5 | 1532. | Priestap, van Baren, et al., 2003 | 30. m/0.2 mm/0.25 μm, He, 75. C @ 4. min, 3. K/min; Tend: 220. C |
Capillary | DB-5 | 1540. | Zoghbi, Andrade, et al., 2003 | 30. m/0.25 mm/0.25 μm, He, 3. K/min; Tstart: 60. C; Tend: 240. C |
Capillary | DB-5 | 1545. | Kabouss, Charrouf, et al., 2002 | 30. m/0.25 mm/0.25 μm, 40. C @ 2. min, 2. K/min, 210. C @ 33. min |
Capillary | DB-5 | 1539. | Kobaisy, Tellez, et al., 2002 | 30. m/0.25 mm/0.25 μm, He, 3. K/min; Tstart: 60. C; Tend: 240. C |
Capillary | DB-5 | 1543. | Maia, da Silva, et al., 2002 | 30. m/0.25 mm/0.25 μm, He, 3. K/min; Tstart: 60. C; Tend: 240. C |
Capillary | DB-5MS | 1543. | Maia, Zoghbi, et al., 2002 | 30. m/0.25 mm/0.25 μm, He, 3. K/min; Tstart: 60. C; Tend: 240. C |
Capillary | CP Sil 5 CB | 1537. | Baser, Özek, et al., 2000 | 25. m/0.25 mm/0.4 μm, He, 60. C @ 40. min, 5. K/min; Tend: 260. C |
Capillary | DB-5 | 1531. | Abreu and Noronha, 1997 | He, 3. K/min; Column length: 30. m; Column diameter: 0.32 mm; Tstart: 60. C; Tend: 250. C |

Normal alkane RI, non-polar column, custom temperature program

Column type | Active phase | I | Reference | Comment |
---|---|---|---|---|
Capillary | DB-5 | 1545. | Rodriques, Amorim, et al., 2013 | 30. m/0.25 mm/0.25 μm, Helium; Program: not specified |
Capillary | DB-1-MS | 1537. | Takeoka, Hobbs, et al., 2010 | 60. m/0.25 mm/0.25 μm, Helium; Program: not specified |
Capillary | DB-1 | 1542. | Xu, Tang, et al., 2010 | 30. m/0.25 mm/0.25 μm, Helium; Program: not specified |
Capillary | DB-5 | 1547. | de Albuquerque, Alves, et al., 2008 | 30. m/0.25 mm/0.25 μm, Hydrogen; Program: 35 0C 4 0C/min -> 180 0C 17 0C/min -> 280 0C (10 min) |
Capillary | HP-5 MS | 1542. | Setzer, Stokes, et al., 2007 | Helium; Column length: 30. m; Column diameter: 0.25 mm; Program: 40 0C (10 min) 3 oC/min -> 200 0C 2 0C/min -> 220 0C |
Capillary | HP-5 MS | 1541. | Schmidt, Noletto, et al., 2006 | 30. m/0.25 mm/0.25 μm, Helium; Program: 40 0C (10 min) 3 0C/min -> 200 0C 2 0C/min -> 220 0C |
Capillary | HP-5MS | 1542. | Grombone-Guaratini, Silva-Brandão, et al., 2005 | 30. m/0.25 mm/0.25 μm, He; Program: not specified |
Capillary | CP Sil 8 CB | 1547. | Nivinskienë, Butkienë, et al., 2005 | 50. m/0.32 mm/0.25 μm, He; Program: 60C(1min) => 5C/min => 160C => 5C/min => 250C(3min) |
Capillary | SE-30 | 1560. | Vinogradov, 2004 | Program: not specified |
Capillary | HP-1 | 1560. | Nogueira and Romano, 2002 | 30. m/0.32 mm/0.25 μm, He; Program: 40C(3min) => 5C/min => 180C => 15C/min => 240C(15min) |
Capillary | CP Sil 5 CB | 1540. | Weyerstahl, Marschall, et al., 2000 | Column length: 25. m; Program: not specified |
Capillary | CP Sil 5 CB | 1542. | Weyerstahl, Marschall, et al., 1998 | N2; Column length: 25. m; Program: not specified |

Normal alkane RI, polar column, temperature ramp

Column type | Active phase | I | Reference | Comment |
---|---|---|---|---|
Capillary | BP-20 | 1776. | Boti, Yao, et al., 2006 | 50. m/0.22 mm/0.25 μm, 2. K/min, 220. C @ 20. min; Tstart: 60. C |
Capillary | Innowax FSC | 1796. | Lourens, Reddy, et al., 2004 | Helium, 60. C @ 10. min, 4. K/min; Column length: 60. m; Column diameter: 0.25 mm; Tend: 220. C |
Capillary | Carbowax 20M | 1800. | Priestap, van Baren, et al., 2003 | 50. m/0.25 mm/0.25 μm, N2, 3. K/min; Tstart: 90. C; Tend: 220. C |
Capillary | Supelcowax-10 | 1750. | Kabouss, Charrouf, et al., 2002 | 30. m/0.25 mm/0.25 μm, 40. C @ 2. min, 2. K/min, 210. C @ 33. min |
Capillary | Innowax | 1796. | Baser, Özek, et al., 2000 | 60. m/0.25 mm/0.25 μm, He, 60. C @ 10. min, 4. K/min, 220. C @ 10. min |
Capillary | DB-Wax | 1793. | Abreu and Noronha, 1997 | He, 3. K/min; Column length: 30. m; Column diameter: 0.32 mm; Tstart: 60. C; Tend: 250. C |
Capillary | DB-Wax | 1791. | van Beek, Kleis, et al., 1989 | 60. m/0.25 mm/0.25 μm, H2, 4. K/min, 238. C @ 13. min; Tstart: 50. C |

Normal alkane RI, polar column, custom temperature program

Column type | Active phase | I | Reference | Comment |
---|---|---|---|---|
Capillary | HP-Innowax FSC | 1796. | Demirci, Baser, et al., 2003 | 60. m/0.25 mm/0.25 μm, He; Program: 60C (10min) => 4C/min => 220C (10min) => 1C/min => 240C |
Capillary | Innowax FSC | 1796. | Baser, Demirei, et al., 2002 | 60. m/0.25 mm/0.25 μm, He; Program: 60C(10min) => 4C/min => 220C(10min) => 1C/min => 240C |
Capillary | Innowax | 1797. | Baser, Özek, et al., 2000, 2 | 60. m/0.25 mm/0.25 μm, He; Program: 60 0C (10 min) 4 K/min -> 220 0C (10 min) 1 K/min -> 240 0C |

References

Maia, Andrade, et al., 2005
Maia, J.G.S.; Andrade, E.H.A.; da Silva, A.C.M.; Oliveira, J.; Carreira, L.M.M.; Araújo, J.S.,
Leaf volatile oils from four Brazilian Xylopia species,
Flavour Fragr. J., 2005, 20, 5, 474-477, https://doi.org/10.1002/ffj.1499
. [all data]
Siani, Garrido, et al., 2004
Siani, A.C.; Garrido, I.S.; Monteiro, S.S.; Carvalho, E.S.; Ramos, M.F.S.,
Protium icicariba as a source of volatile essences,
Biochem. Syst. Ecol., 2004, 32, 5, 477-489, https://doi.org/10.1016/j.bse.2003.11.003
. [all data]
Tzakou and Couladis, 2001
Tzakou, O.; Couladis, M.,
The essential oil of Micromeria graeca (L.) Bentham et Reichenb. growing in Greece,
Flavour Fragr. J., 2001, 16, 2, 107-109, https://doi.org/10.1002/ffj.955
. [all data]
Roussis, Tsoukatou, et al., 2000
Roussis, V.; Tsoukatou, M.; Petrakis, P.V.; Chinou, I.; Skoula, M.; Harborne, J.B.,
Volatile constituents of four Helichrysum species growing in Greece,
Biochem. Syst. Ecol., 2000, 28, 2, 163-175, https://doi.org/10.1016/S0305-1978(99)00046-0
. [all data]
Siani, Ramos, et al., 1999
Siani, A.C.; Ramos, M.F.S.; Menezes-de-Lima, O., Jr.; Ribeiro-dos-Santos, R.; Fernadez-Ferreira, E.; Soares, R.O.A.; Rosas, E.C.; Susunaga, G.S.; Guimarães, A.C.; Zoghbi, M.G.B.; Henriques, M.G.M.O.,
Evaluation of anti-inflammatory-related activity of essential oils from the leaves and resin of species of Protium,
J. Ethnopharmacol., 1999, 66, 1, 57-69, https://doi.org/10.1016/S0378-8741(98)00148-2
. [all data]
Araújo, Silveira, et al., 2003
Araújo, E.C.C.; Silveira, E.R.; Lima, M.A.S.; Neto, M.A.; de Andrade, I.L.; Lima, M.A.A.; Santiago, G.M.P.; Mesquita, A.L.M.,
Insecticidal activity and chemical composition of volatile oils from Hyptis martiusii Benth,
J. Agric. Food Chem., 2003, 51, 13, 3760-3762, https://doi.org/10.1021/jf021074s
. [all data]
Maia, Andrade, et al., 2000
Maia, J.G.S.; Andrade, E.H.A.; Zoghbi, M.G.B.,
Volatile constituents of the leaves, fruits and flowers of cashew ( Anacardium occidentaleL.),
J. Food Comp. Anal., 2000, 13, 3, 227-232, https://doi.org/10.1006/jfca.2000.0894
. [all data]
Flamini, Cioni, et al., 2007
Flamini, G.; Cioni, P.L.; Morelli, I.; Bader, A.,
Essential oils of the aerial parts of three Salvia species from Jordan: Salvia lanigera, S. spinosa and S. syriaca,
Food Chem., 2007, 100, 2, 732-735, https://doi.org/10.1016/j.foodchem.2005.10.032
. [all data]
Melo, Corrêa, et al., 2007
Melo, R.M.; Corrêa, V.F.S.; Amorim, A.C.L.; Miranda, A.L.P.; Rezende, C.M.,
Identification of Impact Aroma Compounds in Eugenia uniflora L. (Brazilian Pitanga) Leaf Essential Oil,
J. Braz. Chem. Soc., 2007, 18, 1, 179-183, https://doi.org/10.1590/S0103-50532007000100020
. [all data]
Duquesnoy, Dinh, et al., 2006
Duquesnoy, E.; Dinh, N.H.; Castola, V.; Casanova, J.,
Composition of a Pyrolytic oil from Cupressus funebris Endl. of Vietnamese origin,
Flavour Fragr. J., 2006, 21, 3, 453-457, https://doi.org/10.1002/ffj.1676
. [all data]
Flamini, Tebano, et al., 2006
Flamini, G.; Tebano, M.; Cioni, P.L.; Bagci, Y.; Dural, H.; Ertugrul, K.; Uysal, T.; Savran, A.,
A multivariate statistical approach to Centaurea classification using essential oil composition data of some species from Turkey,
Pl. Syst. Evol., 2006, 261, 1-4, 217-228, https://doi.org/10.1007/s00606-006-0448-3
. [all data]
Gonny, Cavaleiro, et al., 2006
Gonny, M.; Cavaleiro, C.; Salgueiro, L.; Casanova, J.,
Analysis of Juniperus communis subsp. alpina needle, berry, wood and root oils by combination of GC, GC/MS and 13C-NMR,
Flavour Fragr. J., 2006, 21, 1, 99-106, https://doi.org/10.1002/ffj.1527
. [all data]
Flamini, Luigi Cioni, et al., 2005
Flamini, G.; Luigi Cioni, P.; Morelli, I.,
Composition of the essential oils and in vivo emission of volatiles of four Lamium species from Italy: L. purpureum, L. hybridum, L. bifidum and L. amplexicaule,
Food Chem., 2005, 91, 1, 63-68, https://doi.org/10.1016/j.foodchem.2004.05.047
. [all data]
Vellutini, Baldovini, et al., 2005
Vellutini, M.; Baldovini, N.; de Rocca Serra, D. Tomi; Casanova, J.,
β-Cyclolavandulyl and β-isocyclolavandulyl esters from Peucedanum paniculatum L., an endemic species to Corsica,
Phytochemistry, 2005, 66, 16, 1956-1962, https://doi.org/10.1016/j.phytochem.2005.07.001
. [all data]
Flamini, Luigi Cioni, et al., 2004
Flamini, G.; Luigi Cioni, P.; Morelli, I.,
Essential oils of Galeopsis pubescens and G. tetrahit from Tuscany (Italy),
Flavour Fragr. J., 2004, 19, 4, 327-329, https://doi.org/10.1002/ffj.1307
. [all data]
Pino, Marbot, et al., 2001
Pino, J.A.; Marbot, R.; Vázquez, C.,
Characterization of volatiles in strawberry guava (Psidium cattleianum Sabine) fruit,
J. Agric. Food Chem., 2001, 49, 12, 5883-5887, https://doi.org/10.1021/jf010414r
. [all data]
Andriamaharavo, 2014
Andriamaharavo, N.R.,
Retention Data. NIST Mass Spectrometry Data Center., NIST Mass Spectrometry Data Center, 2014. [all data]
Cardeal, da Silva, et al., 2006
Cardeal, Z.L.; da Silva, M.D.R.G.; Marriott, P.J.,
Comprehensive two-dimensional gas chromatography/mass spectrometric analysis of pepper volatiles,
Rapid Commun. Mass Spectrom., 2006, 20, 19, 2823-2836, https://doi.org/10.1002/rcm.2665
. [all data]
Rodriques, Amorim, et al., 2013
Rodriques, K.A. da.F.; Amorim, L.V.; de Oliveira, J.M.G.; Dias, C.N.; Moraes, D.F.C.; Andrade, E.H. deA.; Maia, J.G.S.; Carneiro, S.M.P.; Carvalho, F.A. deA.,
Eugenia uniflora L. essential oil as a potential anti-Leishmania agent: effect on Leishmania amazonensis and possible mechanism of action,
Evidence-Based Complementary and Alternative Medicine, 2013, 2013, 1-10, https://doi.org/10.1155/2013/279726
. [all data]
Sardashti, Valizadeh, et al., 2013
Sardashti, A.R.; Valizadeh, J.; Adhami, Y.,
Variations in the essential oil composition of Peroskia abrotonolides of different growth stage in Baluchestan,
Middle-East J. Sci. Res., 2013, 13, 6, 781-784. [all data]
Ho, Wang, et al., 2010
Ho, C.-L.; Wang, E.I.-C.; Yu, H.-T.; Yu, H.-M.; Su, Y.-C.,
Composition amd antioxidant activities of essential oils of different tissues from Cryptomeria japonica D. Don,
Quarterly J. Chin. Forestry, 2010, 32, 1, 63-76. [all data]
de Souza, Lopes, et al., 2010
de Souza, A.; Lopes, E.M.C.; da Silva, M.C.; Cordeiro, I.; Young, M.C.M.; Sobral, M.E.G.; Moreno, P.R.H.,
Chemical composition and acetylcholinesterase inhibitory activity of essential oils of Myrceugenia myrciolides (Cambess.) O. Berg and Eugenia riedelliana O. Berg, Myrtaceae,
Braz. J. Pharmacognosy, 2010, 20, 2, 175-179. [all data]
Takeoka, Hobbs, et al., 2010
Takeoka, G.R.; Hobbs, C.; Byeoung-Soo, P.,
Volatile constituents of the aerial parts of Salvia apiana Jepson,
J. Essential Oil. Res., 2010, 22, 3, 241-244, https://doi.org/10.1080/10412905.2010.9700314
. [all data]
Xu, Tang, et al., 2010
Xu, X.; Tang, Z.; Liang, Y.,
Comparative analysis of plant essential oils by GC-MS coupled with integrated chemometric resolution methods,
Anal. Methods, 2010, 2, 4, 359-367, https://doi.org/10.1039/b9ay00213h
. [all data]
Retta, Gattuso, et al., 2009
Retta, D.; Gattuso, M.; Gattuso, S.; Lira, P. Di Leo; van Baren, C.; Ferraro, G.; Bandoni A.,
Essential oil composition of Achyrocline flaccida (Weinm.) DC. (Asteraceae) from different locations of Argentina,
Biochem. Systematics Ecol., 2009, 36, 12, 877-881, https://doi.org/10.1016/j.bse.2008.11.001
. [all data]
Scrivanti, Anton, et al., 2009
Scrivanti, L.R.; Anton, A.M.; Zygadlo, J.A.,
Essential oil conposition of Bothriochloa Kuntze (Poaceae) from South America and their chemotaxonomy,
Biochem. Systematics Ecol., 2009, 37, 3, 206-213, https://doi.org/10.1016/j.bse.2009.03.009
. [all data]
de Souza, Lopes, et al., 2009
de Souza, A.; Lopes, E.M.C.; da Silva, M.C.; Cordeiro, I.; Young, M.C.M.; Sobral, M.E.G.; Moreno, P.R.H.,
Chemical composition and acetylcholinesterase inhibitory activity of essential oils of Myrceugenia myrcioides (Chambess.) O. Berg and Eugenia riedeliana O. Berg, Myrtaceae,
Braz. J. Pharmacognosy, 2009, 20, 2, 175-179. [all data]
Yassa and Akhani, 2008
Yassa, N.; Akhani, H.,
The essential oils composition in two species of the genus Eriocycla Lindl. (Apiaceae) from Iran, 2008, retrieved from http://biology.ut.ac.ir/members/akhani/PdfReprintNumber/27.pdf. [all data]
Adams, Beauchamp, et al., 2007
Adams, R.P.; Beauchamp, P.S.; Dev, V.; Dutz, S.M.,
New Natural Products Isolated from One-Seeded Juniperus of the Southwestern United States: Isolation and Occurence of 2-Ethenyl-3-methyl Phanol and Its Derivatives,
J. Essent. Oil Res., 2007, 19, 2, 146-152, https://doi.org/10.1080/10412905.2007.9699247
. [all data]
El-Ghorab A., El-Massry K.F., et al., 2007
El-Ghorab A.; El-Massry K.F.; Shibamoto T.,
Chemical composition of the volatile extract and antioxidant activities of the volatile and nonvolatile extracts of Egyptian corn silk (Zea mays L.),
J. Agric. Food Chem., 2007, 55, 22, 9124-9127, https://doi.org/10.1021/jf071646e
. [all data]
Mohottalage, Tabacchi, et al., 2007
Mohottalage, S.; Tabacchi, R.; Guerin, P.M.,
Components from Sri Lankan Piper betle L. leaf oil and their analogues showing toxicity against the housefly, Musca domestica,
Flavour Fragr. J., 2007, 22, 2, 130-138, https://doi.org/10.1002/ffj.1770
. [all data]
Yassa and Akhani, 2007
Yassa, N.; Akhani, H.,
The essential oils composition in two species of the genus Eriocycla Lindl. (Apiaceae) from Iran, 2007, retrieved from http://biology.ut.ac.ir/members/akhani/PdfReprintNumber/27.pdf. [all data]
Boti, Yao, et al., 2006
Boti, J.B.; Yao, P.A.; Koukoua, G.; N'Guessan, T.Y.; Casanova, J.,
Components and chemical variability of Isolona campanulata Engler Diels leaf oil,
Flavour Fragr. J., 2006, 21, 1, 166-170, https://doi.org/10.1002/ffj.1555
. [all data]
Pino, Marbot, et al., 2006
Pino, J.A.; Marbot, R.; Payo, A.; Chao, D.; Herrera, P.,
Aromatic Plants from Western Cuba VII. Composition of the Leaf Oil of Psidium wrightii KRug et Urb., Lantana involucrata L., Cinnamonum montanum (Sw.) Berchtold et J. Persl. and Caesalpinia violacea (Mill.) Standley,
J. Essent. Oil. Res., 2006, 18, 2, 170-174, https://doi.org/10.1080/10412905.2006.9699058
. [all data]
Facey, Porter, et al., 2005
Facey, P.C.; Porter, R.B.R.; Reese, P.B.; Williams, L.A.D.,
Biological activity and chemical composition of the essential oil from Jamaican Hyptis verticillata Jacq.,
J. Agric. Food Chem., 2005, 53, 12, 4774-4777, https://doi.org/10.1021/jf050008y
. [all data]
Ferraz, Limberger, et al., 2005
Ferraz, A.B.F.; Limberger, R.P.; Bordignon, S.A.L.; von Poser, G.L.; Henriques, A.T.,
Essential oil composition of six Hypericum species from southern Brazil,
Flavour Fragr. J., 2005, 20, 3, 335-339, https://doi.org/10.1002/ffj.1435
. [all data]
Ghasemi Y., Faridi P., et al., 2005
Ghasemi Y.; Faridi P.; Mehregan I.; Mohagheghzadeh A.,
Ferula gummosa fruits: An aromatic antimicrobial agent,
Chem. Nat. Compd. (Engl. Transl.), 2005, 41, 3, 311-314, https://doi.org/10.1007/s10600-005-0138-3
. [all data]
Grombone-Guaratini, Silva-Brandão, et al., 2005
Grombone-Guaratini, M.T.; Silva-Brandão, K.L.; Solferini, V.N.; Semir, J.; Trigo, J.R.,
Sesquiterpene and polyacetylene profile of the Bidens pilosa complex (Asteraceae: Heliantheae) from Southeast of Brazil,
Biochem. Syst. Ecol., 2005, 33, 5, 479-486, https://doi.org/10.1016/j.bse.2004.11.005
. [all data]
Raal, Paaver, et al., 2004
Raal, A.; Paaver, U.; Arak, E.; Orav, A.,
Content and composition of the essential oil of Thymus serpyllum L. growing wild in Estonia,
Medicina (Kaunas), 2004, 40, 8, 795-800. [all data]
Tellez, Khan, et al., 2004
Tellez, M.R.; Khan, I.A.; Schaneberg, B.T.; Crockett, S.L.; Rimando, A.M.; Kobaisy, M.,
Steam distillation-solid-phase microextraction for the detection of Ephedra sinica in herbal preparations,
J. Chromatogr. A, 2004, 1025, 1, 51-56, https://doi.org/10.1016/S0021-9673(03)01035-5
. [all data]
Morteza-Semnani and Saeedi, 2003
Morteza-Semnani, K.; Saeedi, M.,
Constituents of the essential oil of Commiphora myrrha (Nees) Engl. var. molmol,
J. Essent. Oil Res., 2003, 15, 1, 50-51, https://doi.org/10.1080/10412905.2003.9712264
. [all data]
Priestap, van Baren, et al., 2003
Priestap, H.A.; van Baren, C.M.; Lira, P.D.L.; Coussio, J.D.; Bandoni, A.L.,
Volatile constituents of Aristolochia argentina,
Phytochemistry, 2003, 63, 2, 221-225, https://doi.org/10.1016/S0031-9422(02)00751-3
. [all data]
Zoghbi, Andrade, et al., 2003
Zoghbi, M.G.B.; Andrade, E.H.A.; da Silva, M.H.; Carreira, L.M.M.; Maia, J.G.S.,
Essential oils from three Myrcia species,
Flavour Fragr. J., 2003, 18, 5, 421-424, https://doi.org/10.1002/ffj.1242
. [all data]
Kabouss, Charrouf, et al., 2002
Kabouss, A.E.; Charrouf, Z.; Faid, M.; Garneau, F.-X.; Collin, G.,
Chemical composition and antimicrobial activity of the leaf essential oil of Argania spinosa L. Skeels,
J. Essent. Oil Res., 2002, 14, 2, 147-149, https://doi.org/10.1080/10412905.2002.9699801
. [all data]
Kobaisy, Tellez, et al., 2002
Kobaisy, M.; Tellez, M.R.; Dayan, F.E.; Duke, S.O.,
Phytotoxicity and volatile constituents from leaves of Callicarpa japonica Thunb.,
Phytochemistry, 2002, 61, 1, 37-40, https://doi.org/10.1016/S0031-9422(02)00207-8
. [all data]
Maia, da Silva, et al., 2002
Maia, J.G.S.; da Silva, M.H.L.; Andrade, E.H.A.; Zoghbi, M.G.B.; Carreira, L.M.M.,
Essential oils from Astronium urundeuva (Allemao) Engl. and A. fraxinifolium Schott ex Spreng.,
Flavour Fragr. J., 2002, 17, 1, 72-74, https://doi.org/10.1002/ffj.1046
. [all data]
Maia, Zoghbi, et al., 2002
Maia, J.G.S.; Zoghbi, M.G.B.; Andrade, E.H.A.; da Silva, M.H.L.; Luz, A.I.R.; da Silva, J.D.,
Essential oils composition of Eupatorium species growing wild in the Amazon,
Biochem. Syst. Ecol., 2002, 30, 11, 1071-1077, https://doi.org/10.1016/S0305-1978(02)00059-5
. [all data]
Baser, Özek, et al., 2000
Baser, K.H.C.; Özek, T.; Demirci, B.; Kürkcüoglu, M.; Aytac, Z.; Duman, H.,
Composition of the essential oils of Zosima absinthifolia (Vent.) Link and Ferula elaeochytris Korovin from Turkey,
Flavour Fragr. J., 2000, 15, 6, 371-372, https://doi.org/10.1002/1099-1026(200011/12)15:6<371::AID-FFJ919>3.0.CO;2-Z
. [all data]
Abreu and Noronha, 1997
Abreu, P.M.; Noronha, R.G.,
Volatile constituents of the rhizomes of Aframomum alboviolaceum (Ridley) K. Schum. from Guinea-Bissau,
Flavour Fragr. J., 1997, 12, 2, 79-83, https://doi.org/10.1002/(SICI)1099-1026(199703)12:2<79::AID-FFJ617>3.0.CO;2-7
. [all data]
de Albuquerque, Alves, et al., 2008
de Albuquerque, I.L.; Alves, L.A.; Lemos, T.L.G.; Dorneles, C.A.; de Morais, M.O.,
Constituents of the essential oil of Brazilian grenn propolis from Brazil,
J. Essent. Oil Res., 2008, 20, 1-2. [all data]
Setzer, Stokes, et al., 2007
Setzer, W.N.; Stokes, S.L.; Penton, A.F.; Takaku, S.; Haber, W.A.; Hansell, E.; Caffrey, C.R.; McKerrow, J.H.,
Cruzain inhibitory activity of leaf essential oils of neotropical Lauraceae and essential oil components,
Natural Product Communications, 2007, 2, 12, 1203-1210. [all data]
Schmidt, Noletto, et al., 2006
Schmidt, J.M.; Noletto, J.A.; Vogler, B.; Setzer, W.N.,
Abaco Bush Medicine: Chemical composition of the essential oils of four aromatic medicinal plants from Abaco Island, Bahamas,
J. Herbs, Spices Medicinal Plants, 2006, 12, 3, 43-65, https://doi.org/10.1300/J044v12n03_04
. [all data]
Nivinskienë, Butkienë, et al., 2005
Nivinskienë, O.; Butkienë, R.; Mockutë, D.,
Chemical composition of seed (fruit) essential oils of Angelica archangelica L. growing wild in Lithuania,
Chemija, 2005, 16, 3-4, 51-54. [all data]
Vinogradov, 2004
Vinogradov, B.A.,
Production, composition, properties and application of essential oils, 2004, retrieved from http://viness.narod.ru. [all data]
Nogueira and Romano, 2002
Nogueira, J.M.F.; Romano, A.,
Essential oils from micropropagated plants of Lavandula viridis,
Phytochem. Anal., 2002, 13, 1, 4-7, https://doi.org/10.1002/pca.609
. [all data]
Weyerstahl, Marschall, et al., 2000
Weyerstahl, P.; Marschall, H.; Splittgerber, U.; Wolf, D.; Surburg, H.,
Constituents of Haitian vetiver oil,
Flavour Fragr. J., 2000, 15, 6, 395-412, https://doi.org/10.1002/1099-1026(200011/12)15:6<395::AID-FFJ930>3.0.CO;2-9
. [all data]
Weyerstahl, Marschall, et al., 1998
Weyerstahl, P.; Marschall, H.; Wolf, D.,
Constituents of commercial Brazilian cabore oil,
Flavour Fragr. J., 1998, 13, 2, 85-86, https://doi.org/10.1002/(SICI)1099-1026(199803/04)13:2<85::AID-FFJ697>3.0.CO;2-9
. [all data]
Lourens, Reddy, et al., 2004
Lourens, A.C.U.; Reddy, D.; Baser, K.H.C.; Viljoen, A.M.; Van Vuuren, S.F.,
In vitro Biological Activity and Essential Oil Composition of Four Indigenous South Africal Helichrysum Species,
J. Ethnopharmacol., 2004, 95, 2-3, 253-258, https://doi.org/10.1016/j.jep.2004.07.027
. [all data]
van Beek, Kleis, et al., 1989
van Beek, T.A.; Kleis, R.; Posthumus, M.A.; van Veldhuizen, A.,
Essential oil of Amyris balsamifera,
Phytochemistry, 1989, 28, 7, 1909-1911, https://doi.org/10.1016/S0031-9422(00)97885-3
. [all data]
Demirci, Baser, et al., 2003
Demirci, B.; Baser, K.H.C.; Yildiz, B.; Bahcecioglu, Z.,
Composition of the essential oils of six endemic Salvia spp. from Turkey,
Flavour Fragr. J., 2003, 18, 2, 116-121, https://doi.org/10.1002/ffj.1173
. [all data]
Baser, Demirei, et al., 2002
Baser, K.H.C.; Demirei, B.; Özek, T.; Akalin, E.; Özhatay, N.,
Micro-distilled volatile compounds from Ferulago species growing in Western Turkey,
Pharm. Biol., 2002, 40, 6, 466-471, https://doi.org/10.1076/phbi.40.6.466.8439
. [all data]
Baser, Özek, et al., 2000, 2
Baser, K.H.C.; Özek, T.; Demirci, B.; Duman, H.,
Composition of the essential oil of Prangos heyniae H. Duman et M. F. Watson, a new endemic from Turkey,
Flavour Fragr. J., 2000, 15, 1, 47-49, https://doi.org/10.1002/(SICI)1099-1026(200001/02)15:1<47::AID-FFJ869>3.0.CO;2-9
. [all data]