Hexadecylcyclohexane
- Formula: C22H44
- Molecular weight: 308.5848
- IUPAC Standard InChIKey: NRHBFNBZAZZTAU-UHFFFAOYSA-N
- CAS Registry Number: 6812-38-0
- Chemical structure:
View 3d structure (requires JavaScript / HTML 5) - Other names: Cyclohexane, hexadecyl-; n-Hexadecylcyclohexane

Gas phase thermochemistry data

Data compiled by: Hussein Y. Afeefy, Joel F. Liebman, and Stephen E. Stein
Quantity | Value | Units | Method | Reference | Comment |
---|---|---|---|---|---|
ΔfH°gas | -110.06 ± 0.88 | kcal/mol | Ccb | Prosen, Johnson, et al., 1946 |

Condensed phase thermochemistry data

Data compiled by: Hussein Y. Afeefy, Joel F. Liebman, and Stephen E. Stein
Quantity | Value | Units | Method | Reference | Comment |
---|---|---|---|---|---|
ΔcH°liquid | -3462.06 ± 0.83 | kcal/mol | Ccb | Prosen, Johnson, et al., 1946 | Corresponding ΔfHºliquid = -110.00 kcal/mol (simple calculation by NIST; no Washburn corrections) |

Phase change data

Data compiled as indicated in comments:
TRC - Thermodynamics Research Center, NIST Boulder Laboratories, Chris Muzny director
AC - William E. Acree, Jr., James S. Chickos
Quantity | Value | Units | Method | Reference | Comment |
---|---|---|---|---|---|
Tfus | 306.9 | K | N/A | Matsumoto, 1951 | Uncertainty assigned by TRC = 2. K; TRC |
Tfus | 308.8 | K | N/A | Larsen, Thorpe, et al., 1942 | Uncertainty assigned by TRC = 1. K; TRC |
Tfus | 305.2 | K | N/A | Petrov and Chel'tsova, 1942 | Uncertainty assigned by TRC = 2. K; freezing point; TRC |
Tfus | 304.15 | K | N/A | Petrov and Chel'tsova, 1942 | Uncertainty assigned by TRC = 2. K; melting point; TRC |
Tfus | 305.7 | K | N/A | Schmidt, 1942 | Uncertainty assigned by TRC = 1. K; TRC |
Quantity | Value | Units | Method | Reference | Comment |
ΔvapH° | 26.12 | kcal/mol | N/A | Reid, 1972 | AC |
Enthalpy of vaporization
ΔvapH (kcal/mol) | Temperature (K) | Reference | Comment |
---|---|---|---|
19.0 | 522. | Dykyj, Svoboda, et al., 1999 | Based on data from 507. to 689. K.; AC |

References

Prosen, Johnson, et al., 1946
Prosen, E.J.; Johnson, W.H.; Rossini, F.D.,
Heats of formation and combustion of the normal alkylcyclopentanes and cyclohexanes and the increment per CH2 group for several homologous series of hydrocarbons,
J. Res. NBS, 1946, 37, 51-56. [all data]
Matsumoto, 1951
Matsumoto, T.,
Dehydrogenation of Acetylcyclohexane with Selenium,
Nippon Kagaku Zasshi, 1951, 72, 68. [all data]
Larsen, Thorpe, et al., 1942
Larsen, R.G.; Thorpe, R.E.; Armfield, F.A.,
Oxidation Characteristics of Pure Hydrocarbons,
Ind. Eng. Chem., 1942, 34, 183. [all data]
Petrov and Chel'tsova, 1942
Petrov, A.D.; Chel'tsova, M.A.,
Synthesis and Properties of Hydrocarbons of the Aromatic and Naphthenic Series of the Composition C19-C26. II.,
J. Gen. Chem. USSR (Engl. Transl.), 1942, 12, 87-94. [all data]
Schmidt, 1942
Schmidt, A.W.,
Physical properties of aliphatic compounds,
Ber. Dtsch. Chem. Ges. B, 1942, 75, 1399. [all data]
Reid, 1972
Reid, Robert C.,
Handbook on vapor pressure and heats of vaporization of hydrocarbons and related compounds, R. C. Wilhort and B. J. Zwolinski, Texas A Research Foundation. College Station, Texas(1971). 329 pages.$10.00,
AIChE J., 1972, 18, 6, 1278-1278, https://doi.org/10.1002/aic.690180637
. [all data]
Dykyj, Svoboda, et al., 1999
Dykyj, J.; Svoboda, J.; Wilhoit, R.C.; Frenkel, M.L.; Hall, K.R.,
Vapor Pressure of Chemicals: Part A. Vapor Pressure and Antoine Constants for Hydrocarbons and Sulfur, Selenium, Tellurium and Hydrogen Containing Organic Compounds, Springer, Berlin, 1999, 373. [all data]