6-Amino-3,5-dicyano-3,4-dihydro-2,4-bis-(4-nitrophenyl)-thiopyran-3-thiocarboxamide
- Formula: C20H14N6O4S2
- Molecular weight: 466.493
- CAS Registry Number: 68029-62-9

Reaction thermochemistry data

Data compiled by: Hussein Y. Afeefy, Joel F. Liebman, and Stephen E. Stein
Individual Reactions
By formula: C20H14N6O4S2 = 2C10H7N3O2S
Quantity | Value | Units | Method | Reference | Comment |
---|---|---|---|---|---|
ΔrH° | -58.5 | kJ/mol | Eqk | Brunskill, De, et al., 1980 | liquid phase; solvent: DMSO |

References

Brunskill, De, et al., 1980
Brunskill, J.S.A.; De, A.; Ewing, D.F.,
Substituent effects on reversible cycloaddition reaction,
J. Chem. Soc. Perkin Trans. 2, 1980, 4-7. [all data]