2-Propenethioamide, 2-cyano-3-(4-nitrophenyl)-, (E)-
- Formula: C10H7N3O2S
- Molecular weight: 233.246
- IUPAC Standard InChIKey: ZJUPLUDEWMWRRF-VMPITWQZSA-N
- CAS Registry Number: 68029-55-0
- Chemical structure:

Reaction thermochemistry data

Data compiled by: Hussein Y. Afeefy, Joel F. Liebman, and Stephen E. Stein
Individual Reactions
C20H14N6O4S2 = 2
By formula: C20H14N6O4S2 = 2C10H7N3O2S
Quantity | Value | Units | Method | Reference | Comment |
---|---|---|---|---|---|
ΔrH° | -58.5 | kJ/mol | Eqk | Brunskill, De, et al., 1980 | liquid phase; solvent: DMSO |

References

Brunskill, De, et al., 1980
Brunskill, J.S.A.; De, A.; Ewing, D.F.,
Substituent effects on reversible cycloaddition reaction,
J. Chem. Soc. Perkin Trans. 2, 1980, 4-7. [all data]