2-Propenethioamide, 3-(4-bromophenyl)-2-cyano-, (E)-
- Formula: C10H7BrN2S
- Molecular weight: 267.145
- IUPAC Standard InChIKey: JOJTVFIVYQYWGX-VMPITWQZSA-N
- CAS Registry Number: 68029-54-9
- Chemical structure:

Reaction thermochemistry data

Data compiled by: Hussein Y. Afeefy, Joel F. Liebman, and Stephen E. Stein
Individual Reactions
C20H14Br2N4S2 = 2
By formula: C20H14Br2N4S2 = 2C10H7BrN2S
Quantity | Value | Units | Method | Reference | Comment |
---|---|---|---|---|---|
ΔrH° | -31.4 | kJ/mol | Eqk | Brunskill, De, et al., 1980 | liquid phase; solvent: DMSO |

References

Brunskill, De, et al., 1980
Brunskill, J.S.A.; De, A.; Ewing, D.F.,
Substituent effects on reversible cycloaddition reaction,
J. Chem. Soc. Perkin Trans. 2, 1980, 4-7. [all data]