2-Propenethioamide, 3-(4-chlorophenyl)-2-cyano-, (E)-
- Formula: C10H7ClN2S
- Molecular weight: 222.694
- IUPAC Standard InChIKey: RZHHDALLVIGWBS-VMPITWQZSA-N
- CAS Registry Number: 68029-53-8
- Chemical structure:
View 3d structure (requires JavaScript / HTML 5) - Permanent link for this species. Use this link for bookmarking this species for future reference.

Reaction thermochemistry data

Data compiled by: Hussein Y. Afeefy, Joel F. Liebman, and Stephen E. Stein
Individual Reactions
By formula: C20H14Cl2N4S2 = 2C10H7ClN2S
Quantity | Value | Units | Method | Reference | Comment |
---|---|---|---|---|---|
ΔrH° | -49.0 | kJ/mol | Eqk | Brunskill, De, et al., 1980 | liquid phase; solvent: DMSO |

References

Brunskill, De, et al., 1980
Brunskill, J.S.A.; De, A.; Ewing, D.F.,
Substituent effects on reversible cycloaddition reaction,
J. Chem. Soc. Perkin Trans. 2, 1980, 4-7. [all data]