2-Propenethioamide, 2-cyano-3-phenyl-, (E)-
- Formula: C10H8N2S
- Molecular weight: 188.249
- IUPAC Standard InChIKey: DFVRLZLNOKWNEH-RMKNXTFCSA-N
- CAS Registry Number: 68029-52-7
- Chemical structure:

Reaction thermochemistry data

Data compiled by: Hussein Y. Afeefy, Joel F. Liebman, and Stephen E. Stein
Individual Reactions
C20H16N4S2 = 2
By formula: C20H16N4S2 = 2C10H8N2S
Quantity | Value | Units | Method | Reference | Comment |
---|---|---|---|---|---|
ΔrH° | -19.2 | kcal/mol | Eqk | Brunskill, De, et al., 1980 | liquid phase; solvent: DMSO |

References

Brunskill, De, et al., 1980
Brunskill, J.S.A.; De, A.; Ewing, D.F.,
Substituent effects on reversible cycloaddition reaction,
J. Chem. Soc. Perkin Trans. 2, 1980, 4-7. [all data]