2-Propenethioamide, 2-cyano-3-(4-fluorophenyl)-, (E)-
- Formula: C10H7FN2S
- Molecular weight: 206.239
- IUPAC Standard InChIKey: TXTBVZMAVKCLRA-VMPITWQZSA-N
- CAS Registry Number: 68029-40-3
- Chemical structure:

Reaction thermochemistry data

Data compiled by: Hussein Y. Afeefy, Joel F. Liebman, and Stephen E. Stein
Individual Reactions
C20H14F2N4S2 = 2
By formula: C20H14F2N4S2 = 2C10H7FN2S
Quantity | Value | Units | Method | Reference | Comment |
---|---|---|---|---|---|
ΔrH° | -52.2 | kJ/mol | Eqk | Brunskill, De, et al., 1980 | liquid phase; solvent: DMSO |

References

Brunskill, De, et al., 1980
Brunskill, J.S.A.; De, A.; Ewing, D.F.,
Substituent effects on reversible cycloaddition reaction,
J. Chem. Soc. Perkin Trans. 2, 1980, 4-7. [all data]