Benzene, 2-chloro-1,3-dimethyl-
- Formula: C8H9Cl
- Molecular weight: 140.610
- IUPAC Standard InChIKey: VDXLAYAQGYCQEO-UHFFFAOYSA-N
- CAS Registry Number: 6781-98-2
- Chemical structure:
View 3d structure (requires JavaScript / HTML 5) - Other names: m-Xylene, 2-chloro-; 1-Chloro-2,6-dimethylbenzene; 2-Chloro-m-xylene; 2,6-Dimethylchlorobenzene; 2,6-Dimethylphenyl chloride; 2-Chloro-1,3-dimethylbenzene

Phase change data

Data compiled by: Robert L. Brown and Stephen E. Stein
Quantity | Value | Units | Method | Reference | Comment |
---|---|---|---|---|---|
Tboil | 455.7 | K | N/A | Aldrich Chemical Company Inc., 1990 | |
Tboil | 459.2 | K | N/A | Weast and Grasselli, 1989 |

Normal alkane RI, non-polar column, isothermal

Column type | Active phase | Temperature (C) | I | Reference | Comment |
---|---|---|---|---|---|
Capillary | E-301 | 100. | 1056. | Bermejo, Moinelo, et al., 1980 | N2; Column length: 50. m; Column diameter: 0.25 mm |
Capillary | Squalane | 100. | 1050. | Bermejo, Moinelo, et al., 1980 | N2; Column length: 50. m; Column diameter: 0.25 mm |

References

Aldrich Chemical Company Inc., 1990
Aldrich Chemical Company Inc.,
Catalog Handbook of Fine Chemicals, Aldrich Chemical Company, Inc., Milwaukee WI, 1990, 1. [all data]
Weast and Grasselli, 1989
CRC Handbook of Data on Organic Compounds, 2nd Editon, Weast,R.C and Grasselli, J.G., ed(s)., CRC Press, Inc., Boca Raton, FL, 1989, 1. [all data]
Bermejo, Moinelo, et al., 1980
Bermejo, J.; Moinelo, S.R.; Suarez Canga, C.,
Calculo de indices de retencion a patir de DI y de la polaridad de la fase, Calculo de indices de retencion a patir de DI y de la polaridad de la fase, Instituto Nacional del Carbon y sus Derivados Francisco Pintado Fe (INCAR), La Corredoria, Oviedo, Espana, 1980, 13. [all data]