Ethyl N-phenylformimidate
- Formula: C9H11NO
- Molecular weight: 149.1897
- IUPAC Standard InChIKey: DRDBNKYFCOLNQO-UHFFFAOYSA-N
- CAS Registry Number: 6780-49-0
- Chemical structure:
View 3d structure (requires JavaScript / HTML 5) - Other names: Methanimidic acid, N-phenyl-, ethyl ester; Ethyl isoformanilide

Phase change data

Data compiled by: Robert L. Brown and Stephen E. Stein
Reduced pressure boiling point
Tboil (K) | Pressure (bar) | Reference |
---|---|---|
374. to 375. | 0.020 | Frinton Laboratories Inc., 1986 |

References

Frinton Laboratories Inc., 1986
Frinton Laboratories Inc.,
Catalog Number 11, Frinton Laboratories Inc., Vineland, NJ, 1986, 99. [all data]