1,1,1,3,3,3-hexafluoropropane-2,2-diol
- Formula: C3H2F6O2
- Molecular weight: 184.0372
- IUPAC Standard InChIKey: AKVXSYUWYXOLMY-UHFFFAOYSA-N
- CAS Registry Number: 677-71-4
- Chemical structure:
View 3d structure (requires JavaScript / HTML 5) - Other names: 2,2-Propanediol, 1,1,1,3,3,3-hexafluoro-

Gas phase thermochemistry data

Data compiled by: Hussein Y. Afeefy, Joel F. Liebman, and Stephen E. Stein
Quantity | Value | Units | Method | Reference | Comment |
---|---|---|---|---|---|
ΔfH°gas | -1551. | kJ/mol | Cm | Rogers and Rapiejko, 1971 | Hydration |

Condensed phase thermochemistry data

Data compiled by: Hussein Y. Afeefy, Joel F. Liebman, and Stephen E. Stein
Quantity | Value | Units | Method | Reference | Comment |
---|---|---|---|---|---|
ΔfH°solid | -1622. | kJ/mol | Cm | Rogers and Rapiejko, 1971 | Hydration |

Phase change data

Data compiled by: Hussein Y. Afeefy, Joel F. Liebman, and Stephen E. Stein
Enthalpy of sublimation
ΔsubH (kJ/mol) | Temperature (K) | Method | Reference | Comment |
---|---|---|---|---|
71.1 ± 0.8 | 289. | C | Rogers and Rapiejko, 1971 | Hydration |

Reaction thermochemistry data

Data compiled by: Hussein Y. Afeefy, Joel F. Liebman, and Stephen E. Stein
Individual Reactions
By formula: C3H2F6O2 = C3F6O + H2O
Quantity | Value | Units | Method | Reference | Comment |
---|---|---|---|---|---|
ΔrH° | 85.4 ± 0.8 | kJ/mol | Cm | Rogers and Rapiejko, 1971 | solid phase; Hydration |

References

Rogers and Rapiejko, 1971
Rogers, F.E.; Rapiejko, R.J.,
Thermochemistry of carbonyl addition reactions. I. Addition of water and methanol to hexafluoroacetone,
J. Am. Chem. Soc., 1971, 93, 4596-1597. [all data]