propane, 1,1,1,2,2,3-hexafluoro-
- Formula: C3H2F6
- Molecular weight: 152.0384
- IUPAC Standard InChIKey: SUAMPXQALWYDBK-UHFFFAOYSA-N
- CAS Registry Number: 677-56-5
- Chemical structure:
View 3d structure (requires JavaScript / HTML 5) - Permanent link for this species. Use this link for bookmarking this species for future reference.

Phase change data

Data compiled by: Thermodynamics Research Center, NIST Boulder Laboratories, Chris Muzny director
Quantity | Value | Units | Method | Reference | Comment |
---|---|---|---|---|---|
Tboil | 271.71 | K | N/A | Hwang, DesMarteau, et al., 1992 | Uncertainty assigned by TRC = 0.5 K |
Tboil | 274.4 | K | N/A | Edgell and Parts, 1955 | Uncertainty assigned by TRC = 2. K |

References

Hwang, DesMarteau, et al., 1992
Hwang, S.H.; DesMarteau, D.D.; Beyerlein, A.L.; Smith, N.D.; Joyner, P.,
The heat capacity of fluorinated propane and butane derivatives by differential scanning calorimetry,
J. Therm. Anal., 1992, 38, 2515-28. [all data]
Edgell and Parts, 1955
Edgell, W.F.; Parts, G.A.,
Synthesis of Alkyl and Substituted Alkyl Fluorides from p-Toluenesulfonic Acid Esters. The Preparation of p-Toluenesulfonic Acid Esters of Lower Alcohols,
J. Am. Chem. Soc., 1955, 77, 4899. [all data]