2,5-Diamino-2'-fluorobenzophenone
- Formula: C13H11FN2O
- Molecular weight: 230.2376
- IUPAC Standard InChIKey: OKCCYEPCUCOYDR-UHFFFAOYSA-N
- CAS Registry Number: 67739-74-6
- Chemical structure:
View 3d structure (requires JavaScript / HTML 5) - Other names: 2,5-Diamino-2'-fluor-benzophenone; Benzophenone, 2,5-diamino-2'-fluoro

Kovats' RI, non-polar column, isothermal

Column type | Active phase | Temperature (C) | I | Reference | Comment |
---|---|---|---|---|---|
Packed | SE-30 | 220. | 2152. | Schütz, 1982 | N2 |

Normal alkane RI, non-polar column, custom temperature program

Column type | Active phase | I | Reference | Comment |
---|---|---|---|---|
Other | Methyl Silicone | 2188. | Ardrey and Moffat, 1981 | Program: not specified |

References

Schütz, 1982
Schütz, H.,
Benzodiazepines, Springer-Verlag, New York, 1982, 438. [all data]
Ardrey and Moffat, 1981
Ardrey, R.E.; Moffat, A.C.,
Gas-liquid chromatographic retention indices of 1318 substances of toxicological interest on SE-30 or OV-1 stationary phase,
J. Chromatogr., 1981, 220, 3, 195-252, https://doi.org/10.1016/S0021-9673(00)81925-1
. [all data]