5-Amino-2'-fluoro-2-methylaminobenzophenone
- Formula: C14H13FN2O
- Molecular weight: 244.2642
- IUPAC Standard InChIKey: JPJCSZZRWRMPRU-UHFFFAOYSA-N
- CAS Registry Number: 67739-73-5
- Chemical structure:
View 3d structure (requires JavaScript / HTML 5) - Other names: 2-methylamino-5-amino-2'-fluoro-benzophenone; Benzophenone, 5-amino-2'-fluoro-2-methylamino

Kovats' RI, non-polar column, isothermal

Column type | Active phase | Temperature (C) | I | Reference | Comment |
---|---|---|---|---|---|
Packed | SE-30 | 250. | 2703. | Schütz, 1982 | N2 |
Packed | SE-30 | 280. | 2700. | Schütz, 1982 | N2 |

Normal alkane RI, non-polar column, custom temperature program

Column type | Active phase | I | Reference | Comment |
---|---|---|---|---|
Other | Methyl Silicone | 2703. | Ardrey and Moffat, 1981 | Program: not specified |

References

Schütz, 1982
Schütz, H.,
Benzodiazepines, Springer-Verlag, New York, 1982, 438. [all data]
Ardrey and Moffat, 1981
Ardrey, R.E.; Moffat, A.C.,
Gas-liquid chromatographic retention indices of 1318 substances of toxicological interest on SE-30 or OV-1 stationary phase,
J. Chromatogr., 1981, 220, 3, 195-252, https://doi.org/10.1016/S0021-9673(00)81925-1
. [all data]