Ethane, hexachloro-
- Formula: C2Cl6
- Molecular weight: 236.739
- IUPAC Standard InChIKey: VHHHONWQHHHLTI-UHFFFAOYSA-N
- CAS Registry Number: 67-72-1
- Chemical structure:
View 3d structure (requires JavaScript / HTML 5) - Other names: Avlothane; Carbon hexachloride; Distokal; Distopan; Distopin; Egitol; Falkitol; Fasciolin; Hexachlorethane; Hexachloroethane; Hexachloroethylene; Mottenhexe; Perchloroethane; Phenohep; CCl3CCl3; Ethane hexachloride; Ethylene hexachloride; 1,1,1,2,2,2-Hexachloroethane; Hexachlor-aethan; NCI-C04604; NA 9037; Rcra waste number U131; C2Cl6; Ethane, 1,1,1,2,2,2-hexachloro-; Fron 110; NSC 9224

Gas phase thermochemistry data

Data compiled as indicated in comments:
DRB - Donald R. Burgess, Jr.
ALS - Hussein Y. Afeefy, Joel F. Liebman, and Stephen E. Stein
Quantity | Value | Units | Method | Reference | Comment |
---|---|---|---|---|---|
ΔfH°gas | -134.22 | kJ/mol | Review | Chase, 1998 | Data last reviewed in September, 1967 |
ΔfH°gas | -148.2 ± 5.7 | kJ/mol | Review | Manion, 2002 | weighted average of several measurements of equilibria involving C2Cl6, CCl4, and C2Cl4; DRB |
ΔfH°gas | -143.5 ± 9.4 | kJ/mol | Eqk | Puyo, Balesdent, et al., 1963 | Reanalyzed by Cox and Pilcher, 1970, Original value = -145. ± 4.2 kJ/mol; ALS |
Quantity | Value | Units | Method | Reference | Comment |
S°gas,1 bar | 397.84 | J/mol*K | Review | Chase, 1998 | Data last reviewed in September, 1967 |
Gas Phase Heat Capacity (Shomate Equation)
Cp° = A + B*t + C*t2 + D*t3 +
E/t2
H° − H°298.15= A*t + B*t2/2 +
C*t3/3 + D*t4/4 − E/t + F − H
S° = A*ln(t) + B*t + C*t2/2 + D*t3/3 −
E/(2*t2) + G
Cp = heat capacity (J/mol*K)
H° = standard enthalpy (kJ/mol)
S° = standard entropy (J/mol*K)
t = temperature (K) / 1000.
View plot Requires a JavaScript / HTML 5 canvas capable browser.
Temperature (K) | 298. to 1200. | 1200. to 6000. |
---|---|---|
A | 130.4086 | 193.0180 |
B | 119.9611 | -6.032700 |
C | -100.8403 | 1.008621 |
D | 30.14271 | -0.061181 |
E | -1.698060 | -10.24695 |
F | -183.3153 | -217.8672 |
G | 514.5525 | 595.4167 |
H | -134.2231 | -134.2231 |
Reference | Chase, 1998 | Chase, 1998 |
Comment | Data last reviewed in September, 1967 | Data last reviewed in September, 1967 |

Condensed phase thermochemistry data

Data compiled as indicated in comments:
DRB - Donald R. Burgess, Jr.
ALS - Hussein Y. Afeefy, Joel F. Liebman, and Stephen E. Stein
DH - Eugene S. Domalski and Elizabeth D. Hearing
Quantity | Value | Units | Method | Reference | Comment |
---|---|---|---|---|---|
ΔfH°liquid | -199.2 ± 6.1 | kJ/mol | Review | Manion, 2002 | derived from recommended ΔfHgas° and ΔvapH°; DRB |
Quantity | Value | Units | Method | Reference | Comment |
ΔcH°solid | -727. ± 8. | kJ/mol | Ccb | Smith, Bjellerup, et al., 1953 | ALS |
Quantity | Value | Units | Method | Reference | Comment |
S°solid,1 bar | 237.3 | J/mol*K | N/A | Rakhmenkulov, Gutov, et al., 1975 | Entropy estimated at 13 K to be 3.10 J/mol*K.; DH |
Constant pressure heat capacity of solid
Cp,solid (J/mol*K) | Temperature (K) | Reference | Comment |
---|---|---|---|
198.24 | 298.15 | Rakhmenkulov, Gutov, et al., 1975 | T = 13.7 to 360 K.; DH |
218.0 | 298.5 | Seki and Momotani, 1950 | T = 295 to 351 K. Unsmoothed experimental datum.; DH |

Phase change data

Data compiled as indicated in comments:
TRC - Thermodynamics Research Center, NIST Boulder Laboratories, Chris Muzny director
DRB - Donald R. Burgess, Jr.
AC - William E. Acree, Jr., James S. Chickos
ALS - Hussein Y. Afeefy, Joel F. Liebman, and Stephen E. Stein
CAL - James S. Chickos, William E. Acree, Jr., Joel F. Liebman, Students of Chem 202 (Introduction to the Literature of Chemistry), University of Missouri -- St. Louis
DH - Eugene S. Domalski and Elizabeth D. Hearing
Quantity | Value | Units | Method | Reference | Comment |
---|---|---|---|---|---|
Tboil | 458. | K | N/A | Lecat, 1927 | Uncertainty assigned by TRC = 1. K; TRC |
Tboil | 458. | K | N/A | Lecat, 1926 | Uncertainty assigned by TRC = 1. K; TRC |
Quantity | Value | Units | Method | Reference | Comment |
Tfus | 458. ± 4. | K | AVG | N/A | Average of 7 values; Individual data points |
Quantity | Value | Units | Method | Reference | Comment |
ΔvapH° | 51. ± 2.3 | kJ/mol | Review | Manion, 2002 | estimated from Tb using DvH/Tb correlation for other chloroethanes; DRB |
Quantity | Value | Units | Method | Reference | Comment |
ΔsubH° | 59.0 ± 0.8 | kJ/mol | V | Ivin and Dainton, 1947 | ALS |
Enthalpy of vaporization
ΔvapH (kJ/mol) | Temperature (K) | Method | Reference | Comment |
---|---|---|---|---|
40.3 | 475. | A | Stephenson and Malanowski, 1987 | Based on data from 460. to 513. K.; AC |
51.2 | 360. | A | Stephenson and Malanowski, 1987 | Based on data from 345. to 460. K. See also Dykyj, 1970.; AC |
53.7 | 320. | N/A | Stull, 1947 | Based on data from 305. to 458. K.; AC |
Antoine Equation Parameters
log10(P) = A − (B / (T + C))
P = vapor pressure (bar)
T = temperature (K)
View plot Requires a JavaScript / HTML 5 canvas capable browser.
Temperature (K) | A | B | C | Reference | Comment |
---|---|---|---|---|---|
305.9 to 458.8 | 4.21123 | 1626.945 | -76.102 | Stull, 1947 | Coefficents calculated by NIST from author's data. |
Enthalpy of sublimation
ΔsubH (kJ/mol) | Temperature (K) | Method | Reference | Comment |
---|---|---|---|---|
58.9 | 331. | N/A | Stephenson and Malanowski, 1987 | Based on data from 317. to 345. K.; AC |
50.5 | 335. to 453. | N/A | Lee, 1935 | AC |
59.0 | 310. | GS,A | Nelson, 1930 | Based on data from 288. to 333. K.; AC |
Enthalpy of fusion
ΔfusH (kJ/mol) | Temperature (K) | Reference | Comment |
---|---|---|---|
9.75 | 458. | Domalski and Hearing, 1996 | AC |
Entropy of fusion
ΔfusS (J/mol*K) | Temperature (K) | Reference | Comment |
---|---|---|---|
8.07 | 318. | Domalski and Hearing, 1996 | CAL |
23.83 | 345. | ||
21.29 | 458. |
Temperature of phase transition
Ttrs (K) | Initial Phase | Final Phase | Reference | Comment |
---|---|---|---|---|
454. | crystaline, I | liquid | Murrill and Breed, 1970 | DH |
Enthalpy of phase transition
ΔHtrs (kJ/mol) | Temperature (K) | Initial Phase | Final Phase | Reference | Comment |
---|---|---|---|---|---|
2.100 | 316.8 | crystaline, III | crystaline, II | Petropavlov, Tsygankova, et al., 1988 | DH |
6.300 | 345.0 | crystaline, II | crystaline, I | Petropavlov, Tsygankova, et al., 1988 | DH |
2.644 | 317.4 | crystaline, III | crystaline, II | Rakhmenkulov, Gutov, et al., 1975 | DH |
6.916 | 344.6 | crystaline, II | crystaline, I | Rakhmenkulov, Gutov, et al., 1975 | DH |
2.605 | 320. | crystaline, III | crystaline, II | Murrill and Breed, 1970 | DH |
6.310 | 345. | crystaline, II | crystaline, I | Murrill and Breed, 1970 | DH |
2.565 | 318. | crystaline, III | crystaline, II | Seki and Momotani, 1950 | DH |
8.222 | 345. | crystaline, II | crystaline, I | Seki and Momotani, 1950 | DH |
9.749 | 458. | crystaline, I | liquid | Seki and Momotani, 1950 | DH |
Entropy of phase transition
ΔStrs (J/mol*K) | Temperature (K) | Initial Phase | Final Phase | Reference | Comment |
---|---|---|---|---|---|
6.6 | 316.8 | crystaline, III | crystaline, II | Petropavlov, Tsygankova, et al., 1988 | DH |
18.3 | 345.0 | crystaline, II | crystaline, I | Petropavlov, Tsygankova, et al., 1988 | DH |
8.33 | 317.4 | crystaline, III | crystaline, II | Rakhmenkulov, Gutov, et al., 1975 | DH |
20.1 | 344.6 | crystaline, II | crystaline, I | Rakhmenkulov, Gutov, et al., 1975 | DH |
8.16 | 320. | crystaline, III | crystaline, II | Murrill and Breed, 1970 | DH |
18.32 | 345. | crystaline, II | crystaline, I | Murrill and Breed, 1970 | DH |
8.08 | 318. | crystaline, III | crystaline, II | Seki and Momotani, 1950 | DH |
23.8 | 345. | crystaline, II | crystaline, I | Seki and Momotani, 1950 | DH |
23.0 | 458. | crystaline, I | liquid | Seki and Momotani, 1950 | DH |

Henry's Law data

Data compiled by: Rolf Sander
Henry's Law constant (water solution)
kH(T) = k°H exp(d(ln(kH))/d(1/T) ((1/T) - 1/(298.15 K)))
k°H = Henry's law constant for solubility in water at 298.15 K (mol/(kg*bar))
d(ln(kH))/d(1/T) = Temperature dependence constant (K)
k°H (mol/(kg*bar)) | d(ln(kH))/d(1/T) (K) | Method | Reference | Comment |
---|---|---|---|---|
0.25 | 5600. | L | N/A | |
0.044 | Q | N/A | missing citation give several references for the Henry's law constants but don't assign them to specific species. | |
0.12 | 2600. | X | N/A | |
0.25 | 5600. | X | N/A | |
0.10 | 2100. | X | N/A | |
0.078 | L | N/A | ||
0.81 | V | N/A | ||
0.44 | V | N/A |

Reaction thermochemistry data

Data compiled by: Hussein Y. Afeefy, Joel F. Liebman, and Stephen E. Stein
Individual Reactions
By formula: C2Cl4 + Cl2 = C2Cl6
Quantity | Value | Units | Method | Reference | Comment |
---|---|---|---|---|---|
ΔrH° | -153.6 ± 2.5 | kJ/mol | Cm | Kirkbride, 1956 | liquid phase; Reanalyzed by Cox and Pilcher, 1970, Original value = -150. kJ/mol |
By formula: C2Cl6 = C2Cl4 + Cl2
Quantity | Value | Units | Method | Reference | Comment |
---|---|---|---|---|---|
ΔrH° | 132.6 ± 4.2 | kJ/mol | Eqk | Puyo, Balesdent, et al., 1963 | gas phase |

Kovats' RI, non-polar column, isothermal

Column type | Active phase | Temperature (C) | I | Reference | Comment |
---|---|---|---|---|---|
Packed | OV-1 | 100. | 1068. | Castello and Gerbino, 1988 | He, Chromosorb W DMCS; Column length: 3. m |
Packed | OV-1 | 125. | 1081. | Castello and Gerbino, 1988 | He, Chromosorb W DMCS; Column length: 3. m |
Packed | OV-1 | 75. | 1053. | Castello and Gerbino, 1988 | He, Chromosorb W DMCS; Column length: 3. m |

Kovats' RI, polar column, isothermal

Column type | Active phase | Temperature (C) | I | Reference | Comment |
---|---|---|---|---|---|
Packed | SP-1000 | 100. | 1444.17 | Castello and Gerbino, 1988 | He, Chromosorb W DMCS; Column length: 3. m |
Packed | SP-1000 | 125. | 1461.57 | Castello and Gerbino, 1988 | He, Chromosorb W DMCS; Column length: 3. m |
Packed | SP-1000 | 75. | 1426.53 | Castello and Gerbino, 1988 | He, Chromosorb W DMCS; Column length: 3. m |

Van Den Dool and Kratz RI, non-polar column, temperature ramp

Column type | Active phase | I | Reference | Comment |
---|---|---|---|---|
Capillary | Petrocol DH | 1058. | White, Hackett, et al., 1992 | 100. m/0.25 mm/0.5 μm, He, 1. K/min; Tstart: 30. C; Tend: 220. C |
Packed | SE-30 | 1057.8 | Zilka and Matucha, 1978 | Ar, Chromaton N-AW-DMCS, 8. K/min; Column length: 2. m; Tstart: 40. C |

Normal alkane RI, non-polar column, temperature ramp

Column type | Active phase | I | Reference | Comment |
---|---|---|---|---|
Capillary | OV-101 | 1062. | Zenkevich, Eliseenkov, et al., 2011 | 25. m/0.20 mm/0.25 μm, Nitrogen, 6. K/min; Tstart: 40. C; Tend: 220. C |
Capillary | HP-1 | 1070. | Boatright and Crum, 1997 | 30. m/0.25 mm/0.1 μm, He, 50. C @ 2. min, 5. K/min, 300. C @ 3. min |
Capillary | HP-1 | 1070. | Boatright and Crum, 1997 | 30. m/0.25 mm/0.1 μm, He, 50. C @ 2. min, 5. K/min, 300. C @ 3. min |
Capillary | Ultra-1 | 1056. | Okumura, 1991 | 25. m/0.32 mm/0.25 μm, He, 3. K/min; Tstart: 80. C; Tend: 260. C |
Capillary | SE-54 | 1064. | Harland, Cumming, et al., 1986 | He, 50. C @ 2. min, 8. K/min, 250. C @ 12. min; Column length: 25. m; Column diameter: 0.32 mm |

Normal alkane RI, non-polar column, custom temperature program

Column type | Active phase | I | Reference | Comment |
---|---|---|---|---|
Capillary | Methyl Silicone | 1062. | Zenkevich, 2001 | Program: not specified |
Capillary | OV-1 | 1055. | Waggott and Davies, 1984 | Hydrogen; Column length: 50. m; Column diameter: 0.32 mm; Program: not specified |
Capillary | OV-1, SE-30, Methyl silicone, SP-2100, OV-101, DB-1, etc. | 1055. | Waggott and Davies, 1984 | Hydrogen; Column length: 50. m; Column diameter: 0.32 mm; Program: not specified |
Capillary | OV-1, SE-30, Methyl silicone, SP-2100, OV-101, DB-1, etc. | 1057. | Waggott and Davies, 1984 | Hydrogen; Column length: 50. m; Column diameter: 0.32 mm; Program: not specified |
Capillary | OV-1 | 1085. | Ramsey and Flanagan, 1982 | Program: not specified |

Normal alkane RI, polar column, custom temperature program

Column type | Active phase | I | Reference | Comment |
---|---|---|---|---|
Capillary | Superox 0.6; Carbowax 20M | 1400. | Waggott and Davies, 1984 | Hydrogen; Column length: 50. m; Column diameter: 0.32 mm; Program: not specified |
Capillary | Carbowax 400, Carbowax 20M, Carbowax 1540, Carbowax 4000, Superox 06, PEG 20M, etc. | 1400. | Waggott and Davies, 1984 | Hydrogen; Column length: 50. m; Column diameter: 0.32 mm; Program: not specified |

Lee's RI, non-polar column, temperature ramp

Column type | Active phase | I | Reference | Comment |
---|---|---|---|---|
Capillary | DB-5 | 176.0 | Donnelly, Abdel-Hamid, et al., 1993 | 30. m/0.32 mm/0.25 μm, He, 40. C @ 3. min, 8. K/min, 285. C @ 29.5 min |

Gas phase ion energetics data

Data compiled as indicated in comments:
LLK - Sharon G. Lias, Rhoda D. Levin, and Sherif A. Kafafi
B - John E. Bartmess
Electron affinity determinations
EA (eV) | Method | Reference | Comment |
---|---|---|---|
1.479 ± 0.095 | SI | Gaines, Kay, et al., 1966 | The Magnetron method, lacking mass analysis, is not considered reliable. G3MP2B3 calculations indicate an EA of ca. 1.1 eV.; B |
Ionization energy determinations
IE (eV) | Method | Reference | Comment |
---|---|---|---|
11.1 | PE | Kimura, Katsumata, et al., 1981 | LLK |
11.22 | PE | Kimura, Katsumata, et al., 1981 | Vertical value; LLK |
11.22 | PE | Katsumata and Kimura, 1975 | Vertical value; LLK |

References

Chase, 1998
Chase, M.W., Jr.,
NIST-JANAF Themochemical Tables, Fourth Edition,
J. Phys. Chem. Ref. Data, Monograph 9, 1998, 1-1951. [all data]
Manion, 2002
Manion, J.A.,
Evaluated Enthalpies of Formation of the Stable Closed Shell C1 and C2 Chlorinated Hydrocarbons,
J. Phys. Chem. Ref. Data, 2002, 31, 1, 123-172, https://doi.org/10.1063/1.1420703
. [all data]
Puyo, Balesdent, et al., 1963
Puyo, J.; Balesdent, D.; Niclause, M.; Dzierzynski, M.,
Etude analytique et thermodynamique de la pyrolyse de l'hexachloroethane en phase gazeuse.,
Compt. Rend., 1963, 256, 3471-3473. [all data]
Cox and Pilcher, 1970
Cox, J.D.; Pilcher, G.,
Thermochemistry of Organic and Organometallic Compounds, Academic Press, New York, 1970, 1-636. [all data]
Smith, Bjellerup, et al., 1953
Smith, L.; Bjellerup, L.; Krook, S.; Westermark, H.,
Heats of combustion of organic chloro compounds determined by the "quartz wool" method,
Acta Chem. Scand., 1953, 7, 65. [all data]
Rakhmenkulov, Gutov, et al., 1975
Rakhmenkulov, S.S.; Gutov, S.A.; Paukov, I.E.,
The heat capacity of hexachloroethane in the temperature range 13.7-360 K and the temperatures and enthalpies of its phase transition,
Zhur. Fiz. Khim., 1975, 49, 2722. [all data]
Seki and Momotani, 1950
Seki, S.; Momotani, M.,
Heats of transition of hexachloroethane,
Bull. Chem. Soc. Japan, 1950, 23, 30-31. [all data]
Lecat, 1927
Lecat, M.,
New binary azeotropes: 7th list,
Ann. Soc. Sci. Bruxelles, Ser. B, 1927, 47, 108-14. [all data]
Lecat, 1926
Lecat, M.,
New binary azeotropes: 3rd list,
Ann. Soc. Sci. Bruxelles, Ser. B, 1926, 45, 284-94. [all data]
Ivin and Dainton, 1947
Ivin, K.J.; Dainton, F.S.,
The vapour pressures, latent heats of sublimation and transition points of solid hexachloroethane,
Trans. Faraday Soc., 1947, 43, 32. [all data]
Stephenson and Malanowski, 1987
Stephenson, Richard M.; Malanowski, Stanislaw,
Handbook of the Thermodynamics of Organic Compounds, 1987, https://doi.org/10.1007/978-94-009-3173-2
. [all data]
Dykyj, 1970
Dykyj, J.,
Petrochemica, 1970, 10, 2, 51. [all data]
Stull, 1947
Stull, Daniel R.,
Vapor Pressure of Pure Substances. Organic and Inorganic Compounds,
Ind. Eng. Chem., 1947, 39, 4, 517-540, https://doi.org/10.1021/ie50448a022
. [all data]
Lee, 1935
Lee, P.J.V.D.,
«65533»ber den Dampfdruck des Hexachlor«65533»thans,
Z. Anorg. Allg. Chem., 1935, 223, 3, 213-216, https://doi.org/10.1002/zaac.19352230304
. [all data]
Nelson, 1930
Nelson, O.A.,
Vapor Pressures of Fumigants,
Ind. Eng. Chem., 1930, 22, 9, 971-972, https://doi.org/10.1021/ie50249a020
. [all data]
Domalski and Hearing, 1996
Domalski, Eugene S.; Hearing, Elizabeth D.,
Heat Capacities and Entropies of Organic Compounds in the Condensed Phase. Volume III,
J. Phys. Chem. Ref. Data, 1996, 25, 1, 1, https://doi.org/10.1063/1.555985
. [all data]
Murrill and Breed, 1970
Murrill, E.; Breed, L.W.,
Solid-solid phase transitions determined by differental scanning calorimetry Part II. Octahedral substances,
Thermochim. Acta, 1970, 1, 409-414. [all data]
Petropavlov, Tsygankova, et al., 1988
Petropavlov, N.N.; Tsygankova, I.G.; Teslenko, L.A.,
Microcalorimetric investigation of polymorphic transitions in organic crystals,
Sov. Phys. Crystallogr., 1988, 33(6), 853-855. [all data]