Methylphosphonyldifluoride

Condensed phase thermochemistry data

Data compiled by: Eugene S. Domalski and Elizabeth D. Hearing

Quantity Value Units Method Reference Comment
liquid208.34J/mol*KN/AFurukawa, Reilly, et al., 1964

Constant pressure heat capacity of liquid

Cp,liquid (J/mol*K) Temperature (K) Reference Comment
145.14298.15Furukawa, Reilly, et al., 1964T = 15 to 335 K.

References

Furukawa, Reilly, et al., 1964
Furukawa, G.T.; Reilly, M.L.; Piccirelli, J.H.; Tenenbaum, M., Thermodynamic properties of some methylphosphonyl dihalides from 15 to 335 K, J. Res., 1964, NBS A68, 367-379. [all data]