1-Heptadecene
- Formula: C17H34
- Molecular weight: 238.4519
- IUPAC Standard InChIKey: ADOBXTDBFNCOBN-UHFFFAOYSA-N
- CAS Registry Number: 6765-39-5
- Chemical structure:
View 3d structure (requires JavaScript / HTML 5) - Other names: Hexahydroaplotaxene; Heptadec-1-ene; NSC 77132; Heptadecene-

Phase change data

Data compiled as indicated in comments:
BS - Robert L. Brown and Stephen E. Stein
TRC - Thermodynamics Research Center, NIST Boulder Laboratories, Chris Muzny director
AC - William E. Acree, Jr., James S. Chickos
Quantity | Value | Units | Method | Reference | Comment |
---|---|---|---|---|---|
Tboil | 573.2 | K | N/A | Weast and Grasselli, 1989 | BS |
Quantity | Value | Units | Method | Reference | Comment |
Tfus | 283.85 | K | N/A | Anonymous, 1968 | Uncertainty assigned by TRC = 0.5 K; TRC |
Tfus | 284. | K | N/A | Schmidt, 1942 | Uncertainty assigned by TRC = 2. K; TRC |
Tfus | 284. | K | N/A | Schmidt, Schoeller, et al., 1941 | Uncertainty assigned by TRC = 2. K; TRC |
Quantity | Value | Units | Method | Reference | Comment |
ΔvapH° | 84.9 | kJ/mol | N/A | Reid, 1972 | AC |
Reduced pressure boiling point
Tboil (K) | Pressure (bar) | Reference | Comment |
---|---|---|---|
431.2 | 0.015 | Aldrich Chemical Company Inc., 1990 | BS |
433.2 | 0.013 | Weast and Grasselli, 1989 | BS |
Enthalpy of vaporization
ΔvapH (kJ/mol) | Temperature (K) | Method | Reference | Comment |
---|---|---|---|---|
55.5 | 613. | N/A | Dykyj, Svoboda, et al., 1999 | Based on data from 598. to 746. K.; AC |
72.3 | 391. | A | Stephenson and Malanowski, 1987 | Based on data from 376. to 432. K.; AC |

Reaction thermochemistry data

Data compiled by: Hussein Y. Afeefy, Joel F. Liebman, and Stephen E. Stein
Individual Reactions
By formula: H2 + C17H34 = C17H36
Quantity | Value | Units | Method | Reference | Comment |
---|---|---|---|---|---|
ΔrH° | -124.1 ± 1.8 | kJ/mol | Chyd | Rogers and Skanupong, 1974 | liquid phase; solvent: Hexane |

Normal alkane RI, polar column, custom temperature program

Data compiled by: NIST Mass Spectrometry Data Center, William E. Wallace, director

Column type CapillaryCapillary
Active phase HP-Innowax FSCHP-Innowax FSC
Column length (m) 60.60.
Carrier gas N2He
Substrate
Column diameter (mm) 0.250.25
Phase thickness (μm) 0.250.25
Program 60C(10min) => 4C/min => 220C(10min) => 1C/min => 240C60C(10min) => 4C/min => 220C(10min) => 1C/min => 240C(20min)
I 1751.1719.
ReferenceTunalier, Candan, et al., 2006Kamariah, Lim, et al., 1999
Comment MSDC-RI MSDC-RI

Normal alkane RI, non-polar column, custom temperature program

Data compiled by: NIST Mass Spectrometry Data Center, William E. Wallace, director

Column type CapillaryCapillary
Active phase HP-5MSDexsil 300
Column length (m) 30.15.
Carrier gas He
Substrate
Column diameter (mm) 0.25
Phase thickness (μm) 0.25
Program 40C(3min) => 8C/min => 160C => 15C/min => 300C50 0C 5 0C/min -> 200 0C 2 0C/min -> 340 0C
I 1687.1695.
ReferenceMu, Wang, et al., 2007Lockey, 1981
Comment MSDC-RI MSDC-RI

Van Den Dool and Kratz RI, polar column, temperature ramp

Data compiled by: NIST Mass Spectrometry Data Center, William E. Wallace, director

Column type Capillary
Active phase DB-Wax
Column length (m) 30.
Carrier gas He
Substrate
Column diameter (mm) 0.25
Phase thickness (μm) 0.5
Tstart (C) 50.
Tend (C) 260.
Heat rate (K/min) 4.
Initial hold (min)
Final hold (min) 5.
I 1751.
ReferenceSelli, Rannou, et al., 2006
Comment MSDC-RI

References

Weast and Grasselli, 1989
CRC Handbook of Data on Organic Compounds, 2nd Editon, Weast,R.C and Grasselli, J.G., ed(s)., CRC Press, Inc., Boca Raton, FL, 1989, 1. [all data]
Anonymous, 1968
Anonymous, R.,
Properties of hydrocarbon of high molecular weight, Am. Pet. Inst. Res. Proj. 42, Penn. State Univ., 1968. [all data]
Schmidt, 1942
Schmidt, A.W.,
Physical properties of aliphatic compounds,
Ber. Dtsch. Chem. Ges. B, 1942, 75, 1399. [all data]
Schmidt, Schoeller, et al., 1941
Schmidt, A.W.; Schoeller, V.; Eberlein, K.,
Chem. Ber., 1941, 74, 1313. [all data]
Reid, 1972
Reid, Robert C.,
Handbook on vapor pressure and heats of vaporization of hydrocarbons and related compounds, R. C. Wilhort and B. J. Zwolinski, Texas A Research Foundation. College Station, Texas(1971). 329 pages.$10.00,
AIChE J., 1972, 18, 6, 1278-1278, https://doi.org/10.1002/aic.690180637
. [all data]
Aldrich Chemical Company Inc., 1990
Aldrich Chemical Company Inc.,
Catalog Handbook of Fine Chemicals, Aldrich Chemical Company, Inc., Milwaukee WI, 1990, 1. [all data]
Dykyj, Svoboda, et al., 1999
Dykyj, J.; Svoboda, J.; Wilhoit, R.C.; Frenkel, M.L.; Hall, K.R.,
Vapor Pressure of Chemicals: Part A. Vapor Pressure and Antoine Constants for Hydrocarbons and Sulfur, Selenium, Tellurium and Hydrogen Containing Organic Compounds, Springer, Berlin, 1999, 373. [all data]
Stephenson and Malanowski, 1987
Stephenson, Richard M.; Malanowski, Stanislaw,
Handbook of the Thermodynamics of Organic Compounds, 1987, https://doi.org/10.1007/978-94-009-3173-2
. [all data]
Rogers and Skanupong, 1974
Rogers, D.W.; Skanupong, S.,
Heats of hydrogenation of sixteen terminal monoolefins. The alternating effect,
J. Phys. Chem., 1974, 78, 2569-2572. [all data]