n-Hexyl-2,2'-iminodiethanol
- Formula: C10H23NO2
- Molecular weight: 189.2951
- IUPAC Standard InChIKey: GIACMWUKBLHAAG-UHFFFAOYSA-N
- CAS Registry Number: 6752-33-6
- Chemical structure:
View 3d structure (requires JavaScript / HTML 5) - Other names: 2,2'-(n-Hexylamino)diethanol; 2,2'-(Hexylamino)diethanol

Phase change data

Data compiled by: Robert L. Brown and Stephen E. Stein
Reduced pressure boiling point
Tboil (K) | Pressure (bar) | Reference |
---|---|---|
427. to 428. | 0.005 | Frinton Laboratories Inc., 1986 |

References

Frinton Laboratories Inc., 1986
Frinton Laboratories Inc.,
Catalog Number 11, Frinton Laboratories Inc., Vineland, NJ, 1986, 99. [all data]