Bis(3,3,3-trifluoropropyl)-ether
- Formula: C6H8F6O
- Molecular weight: 210.1175
- IUPAC Standard InChIKey: IWDSRIHZWYDMFC-UHFFFAOYSA-N
- CAS Registry Number: 674-65-7
- Chemical structure:
View 3d structure (requires JavaScript / HTML 5) - Permanent link for this species. Use this link for bookmarking this species for future reference.

Gas phase thermochemistry data

Data compiled by: Hussein Y. Afeefy, Joel F. Liebman, and Stephen E. Stein
Quantity | Value | Units | Method | Reference | Comment |
---|---|---|---|---|---|
ΔfH°gas | -1604.4 ± 2.5 | kJ/mol | Ccr | Slavutskaya, Kolesov, et al., 1974 | Reanalyzed by Kolesov and Kozina, 1986, Original value = -1585.1 kJ/mol |

Condensed phase thermochemistry data

Data compiled by: Hussein Y. Afeefy, Joel F. Liebman, and Stephen E. Stein
Quantity | Value | Units | Method | Reference | Comment |
---|---|---|---|---|---|
ΔfH°liquid | -1645.4 ± 1.3 | kJ/mol | Ccr | Slavutskaya, Kolesov, et al., 1974 | Reanalyzed by Kolesov and Kozina, 1986, Original value = -1626.1 ± 1.0 kJ/mol |
Quantity | Value | Units | Method | Reference | Comment |
ΔcH°liquid | -2932.9 ± 1.0 | kJ/mol | Ccr | Slavutskaya, Kolesov, et al., 1974 |

Phase change data

Data compiled by: Hussein Y. Afeefy, Joel F. Liebman, and Stephen E. Stein
Quantity | Value | Units | Method | Reference | Comment |
---|---|---|---|---|---|
ΔvapH° | 41. | kJ/mol | E | Slavutskaya, Kolesov, et al., 1974 |

References

Slavutskaya, Kolesov, et al., 1974
Slavutskaya, G.M.; Kolesov, V.P.; Borisov, S.B.,
Standard enthalpies of formation of 1,1,1-trifluoropropyl ether and methyl pentafluoropropionate,
Russ. J. Phys. Chem. (Engl. Transl.), 1974, 48, 456-457. [all data]
Kolesov and Kozina, 1986
Kolesov, V.P.; Kozina, M.P.,
Thermochemistry of organic and organohalogen compounds,
Russ. Chem. Rev., 1986, 55, 912. [all data]