Benzene, undecyl-
- Formula: C17H28
- Molecular weight: 232.4042
- IUPAC Standard InChIKey: XBEADGFTLHRJRB-UHFFFAOYSA-N
- CAS Registry Number: 6742-54-7
- Chemical structure:
View 3d structure (requires JavaScript / HTML 5) - Other names: Undecane, 1-phenyl-; n-Undecylbenzene; Undecylbenzene; 1-Phenylundecane; Phenylundecane; Undecanylbenzene

Phase change data

Data compiled as indicated in comments:
TRC - Thermodynamics Research Center, NIST Boulder Laboratories, Chris Muzny director
AC - William E. Acree, Jr., James S. Chickos
Quantity | Value | Units | Method | Reference | Comment |
---|---|---|---|---|---|
Tboil | 569. | K | N/A | Morton, Davidson, et al., 1942 | Uncertainty assigned by TRC = 4. K; TRC |
Quantity | Value | Units | Method | Reference | Comment |
ΔvapH° | 82.4 ± 0.4 | kJ/mol | GS | Verevkin, 2006 | Based on data from 313. to 364. K.; AC |
ΔvapH° | 84.7 | kJ/mol | N/A | Reid, 1972 | AC |
Enthalpy of vaporization
ΔvapH (kJ/mol) | Temperature (K) | Reference | Comment |
---|---|---|---|
66.7 | 465. | Dykyj, Svoboda, et al., 1999 | Based on data from 450. to 622. K.; AC |

References

Morton, Davidson, et al., 1942
Morton, A.A.; Davidson, J.B.; Best, R.J.,
Condensation by Sodium XXI. n-Octyl and n-Decylsodium,
J. Am. Chem. Soc., 1942, 64, 2239. [all data]
Verevkin, 2006
Verevkin, Sergey P.,
Vapour pressures and enthalpies of vaporization of a series of the linear n-alkyl-benzenes,
The Journal of Chemical Thermodynamics, 2006, 38, 9, 1111-1123, https://doi.org/10.1016/j.jct.2005.11.009
. [all data]
Reid, 1972
Reid, Robert C.,
Handbook on vapor pressure and heats of vaporization of hydrocarbons and related compounds, R. C. Wilhort and B. J. Zwolinski, Texas A Research Foundation. College Station, Texas(1971). 329 pages.$10.00,
AIChE J., 1972, 18, 6, 1278-1278, https://doi.org/10.1002/aic.690180637
. [all data]
Dykyj, Svoboda, et al., 1999
Dykyj, J.; Svoboda, J.; Wilhoit, R.C.; Frenkel, M.L.; Hall, K.R.,
Vapor Pressure of Chemicals: Part A. Vapor Pressure and Antoine Constants for Hydrocarbons and Sulfur, Selenium, Tellurium and Hydrogen Containing Organic Compounds, Springer, Berlin, 1999, 373. [all data]