Ethyl methylphosphonofluoridate
- Formula: C3H8FO2P
- Molecular weight: 126.0666
- IUPAC Standard InChIKey: RIYPSXBGLXRZNJ-UHFFFAOYSA-N
- CAS Registry Number: 673-97-2
- Chemical structure:
View 3d structure (requires JavaScript / HTML 5) - Other names: Phoshonofluoridic acid, methyl-, ethyl ester; Methylphoshonic acid, fluoroanhydride-, ethyl ester; Phosphonofluoridic acid, P-methyl-, ethyl ester; O-Ethyl methylphosphonofluoridate

Van Den Dool and Kratz RI, non-polar column, temperature ramp

Column type | Active phase | I | Reference | Comment |
---|---|---|---|---|
Capillary | SE-54 | 755. | Kostiainen, 2000 | 25. m/0.32 mm/0.25 μm, He, 40. C @ 1. min, 10. K/min, 280. C @ 10. min |

Normal alkane RI, non-polar column, temperature ramp

Column type | Active phase | I | Reference | Comment |
---|---|---|---|---|
Capillary | SE-54 | 754.9 | Söderström, Ketola, et al., 1995 | 25. m/0.32 mm/0.25 μm, He, 40. C @ 2. min, 10. K/min, 250. C @ 10. min |

References

Kostiainen, 2000
Kostiainen, O.,
Gas Chromatography in Screening of Chemicals Related to the Chemical Weapons Convention
in Encyclopedia of Analytical Chemistry, Meyers, R.A., ed(s)., John Wiley Sons Ltd, Chichester, 2000, 963-979. [all data]
Söderström, Ketola, et al., 1995
Söderström, M.T.; Ketola, R.A.; Kostiainen, O.,
Identification of some nerve agent homologues and dialkyl methylphosphonates by gas chromatography/Fourier transform infrared spectrometry. Part II. Spectral search with the help of retention indices,
Fresenius J. Anal. Chem., 1995, 352, 6, 550-556, https://doi.org/10.1007/BF00323072
. [all data]