(p-Methoxyphenyl)phenylmethyl chloride
- Formula: C14H13ClO
- Molecular weight: 232.705
- IUPAC Standard InChIKey: FKRXYCHXGNKYPV-UHFFFAOYSA-N
- CAS Registry Number: 6731-11-9
- Chemical structure:
View 3d structure (requires JavaScript / HTML 5) - Permanent link for this species. Use this link for bookmarking this species for future reference.

Reaction thermochemistry data

Data compiled by: Hussein Y. Afeefy, Joel F. Liebman, and Stephen E. Stein
Individual Reactions
+
= C20H25ClO
By formula: C14H13ClO + C6H12 = C20H25ClO
Quantity | Value | Units | Method | Reference | Comment |
---|---|---|---|---|---|
ΔrH° | -84.5 ± 6.3 | kJ/mol | Cm | Schade, Mayr, et al., 1988 | liquid phase; solvent: Methylene chloride |

References

Schade, Mayr, et al., 1988
Schade, C.; Mayr, H.; Arnett, E.M.,
Thermochemical study of the addition of carbenium ions to alkenes,
J. Am. Chem. Soc., 1988, 110, 567-571. [all data]