2H-Pyran-2-one, 4-methoxy-6-methyl-
- Formula: C7H8O3
- Molecular weight: 140.1366
- IUPAC Standard InChIKey: MTZAUZNQAMNFME-UHFFFAOYSA-N
- CAS Registry Number: 672-89-9
- Chemical structure:
View 3d structure (requires JavaScript / HTML 5) - Other names: Methyltriacetolactone; 4-Methoxy-6-methyl-2H-pyran-2-one; Methyltriacetolacton; 2H-Pyran-2-one, 6-methyl-4-methoxy

Phase change data

Data compiled by: William E. Acree, Jr., James S. Chickos
Enthalpy of vaporization
ΔvapH (kJ/mol) | Temperature (K) | Method | Reference | Comment |
---|---|---|---|---|
57.4 | 400. | A | Stephenson and Malanowski, 1987 | Based on data from 385. to 434. K. |

Reaction thermochemistry data

Data compiled by: Hussein Y. Afeefy, Joel F. Liebman, and Stephen E. Stein
Individual Reactions
By formula: C7H8O3 = C7H8O3
Quantity | Value | Units | Method | Reference | Comment |
---|---|---|---|---|---|
ΔrH° | -24. ± 3. | kJ/mol | Ciso | Beak, Mueller, et al., 1974 | liquid phase; solvent: 1,2-Dichloroethane; #LED |
ΔrH° | -37. ± 8.8 | kJ/mol | Ciso | Beak, Mueller, et al., 1974 | gas phase; Hr gas phase |

Normal alkane RI, non-polar column, temperature ramp

Column type | Active phase | I | Reference | Comment |
---|---|---|---|---|
Capillary | DB-1 | 1297. | Peppard, 1992 | 30. m/0.25 mm/1.0 μm, He, 3. K/min, 250. C @ 30. min; Tstart: 40. C |

References

Stephenson and Malanowski, 1987
Stephenson, Richard M.; Malanowski, Stanislaw,
Handbook of the Thermodynamics of Organic Compounds, 1987, https://doi.org/10.1007/978-94-009-3173-2
. [all data]
Beak, Mueller, et al., 1974
Beak, P.; Mueller, D.S.; Lee, J.,
Equilibration studies. Determination of the enthalpy difference between methyltropic isomers from heats of methylation,
J. Am. Chem. Soc., 1974, 96, 3867-3874. [all data]
Peppard, 1992
Peppard, T.L.,
Volatile flavor constituents of Monstera deliciosa,
J. Agric. Food Chem., 1992, 40, 2, 257-262, https://doi.org/10.1021/jf00014a018
. [all data]