2-Hexenal, (E)-
- Formula: C6H10O
- Molecular weight: 98.1430
- IUPAC Standard InChIKey: MBDOYVRWFFCFHM-SNAWJCMRSA-N
- CAS Registry Number: 6728-26-3
- Chemical structure:
View 3d structure (requires JavaScript / HTML 5) - Species with the same structure:
- Isotopologues:
- Stereoisomers:
- Other names: (E)-2-Hexenal; n-Hex-trans-2-enal; trans-Hex-2-enal; trans-2-Hexen-1-al; trans-2-Hexenal; Leaf aldehyde; 2-trans-Hexenal; (2E)-2-Hexenal; 2-(E)-Hexenal; (E)-2-Hexanal; (E)-2-Hexen-1-al; (E)-Hex-2-en-1-al; (E)-Hex-2-enal; Hex-2(E)-enal; Hex-trans-2-enal; t-2-Hexenal; 2-Hexenal, (2E)-

Phase change data

Data compiled by: Robert L. Brown and Stephen E. Stein
Quantity | Value | Units | Method | Reference | Comment |
---|---|---|---|---|---|
Tboil | 419.7 | K | N/A | Weast and Grasselli, 1989 |
Reduced pressure boiling point
Tboil (K) | Pressure (bar) | Reference |
---|---|---|
320.2 | 0.023 | Aldrich Chemical Company Inc., 1990 |
316.2 | 0.016 | Weast and Grasselli, 1989 |

Henry's Law data

Data compiled by: Rolf Sander
Henry's Law constant (water solution)
kH(T) = k°H exp(d(ln(kH))/d(1/T) ((1/T) - 1/(298.15 K)))
k°H = Henry's law constant for solubility in water at 298.15 K (mol/(kg*bar))
d(ln(kH))/d(1/T) = Temperature dependence constant (K)
k°H (mol/(kg*bar)) | d(ln(kH))/d(1/T) (K) | Method | Reference |
---|---|---|---|
20. | M | N/A |

Normal alkane RI, non-polar column, temperature ramp

Data compiled by: NIST Mass Spectrometry Data Center, William E. Wallace, director

Column type CapillaryCapillaryCapillaryCapillaryCapillary
Active phase DB-5VF-5 MSHP-5 MSHP-5DB-5 MS
Column length (m) 30.30.30.30.25.
Carrier gas HeliumHeliumHeliumHeliumHelium
Substrate
Column diameter (mm) 0.250.250.250.2520.30
Phase thickness (μm) 0.250.250.250.250.25
Tstart (C) 60.40.40.60.50.
Tend (C) 240.250.260.240.240.
Heat rate (K/min) 3.5.4.3.3.
Initial hold (min)  3.
Final hold (min)  3.5.
I 855.859.851.847.852.
ReferenceFraternale, Ricci, et al., 2011Liu, Lu, et al., 2011Miyazawa, Marumoto, et al., 2011Cavar, Maksimovic, et al., 2010Chalchat, Figueredo, et al., 2010
Comment MSDC-RI MSDC-RI MSDC-RI MSDC-RI MSDC-RI
Column type CapillaryCapillaryCapillaryCapillaryCapillary
Active phase HP-5 MSHP-5 MSDB-1DB-5 MSHP-5 MS
Column length (m) 30.30.30.30.30.
Carrier gas HeliumHeliumHeliumHeliumHelium
Substrate
Column diameter (mm) 0.250.250.250.320.25
Phase thickness (μm) 0.250.250.250.250.25
Tstart (C) 60.70.50.40.35.
Tend (C) 220.290.220.230.195.
Heat rate (K/min) 5.5.4.6.2.
Initial hold (min) 10. 2.2.5.
Final hold (min)  10.2.20.30.
I 854.854.823.848.850.
ReferenceOgunwande, Flamini, et al., 2010Radulovic, Blagojevic, et al., 2010Xu, Tang, et al., 2010Chen, Song, et al., 2009Kim and Chung, 2009
Comment MSDC-RI MSDC-RI MSDC-RI MSDC-RI MSDC-RI
Column type CapillaryCapillaryCapillaryCapillaryCapillary
Active phase HP-5 MSMega 5 MSHP-5 MSHP-5MSHP-5 MS
Column length (m) 30.60.30.30.30.
Carrier gas HeliumHeliumHeliumHeliumHelium
Substrate
Column diameter (mm) 0.250.250.320.250.25
Phase thickness (μm) 0.250.250.500.250.25
Tstart (C) 40.40.50.50.50.
Tend (C) 250.240.250.240.280.
Heat rate (K/min) 4.3.5.5.4.
Initial hold (min) 2.2.
Final hold (min) 5. 5.
I 821.821.819.850.851.
ReferenceRaffo, Kelderer, et al., 2009Romeo, Verzera, et al., 2009Sylla, Berge, et al., 2009Wannes, Mhamdi, et al., 2009Zhao, Zeng, et al., 2009
Comment MSDC-RI MSDC-RI MSDC-RI MSDC-RI MSDC-RI
Column type CapillaryCapillaryCapillaryCapillaryCapillary
Active phase HP-1HP-5HP-5 MSSPB-1DB-1
Column length (m) 50.30.30.30.30.
Carrier gas HeliumN2HeliumHeliumHe
Substrate
Column diameter (mm) 0.200.250.250.250.25
Phase thickness (μm) 0.330.250.251.00.25
Tstart (C) 60.60.50.60.30.
Tend (C) 250.220.230.250.210.
Heat rate (K/min) 2.5.4.5.5.
Initial hold (min)  10.4.5.
Final hold (min) 20. 10.
I 824.856.855.829.825.
ReferenceBreme, Langle, et al., 2008Flamini, Tebano, et al., 2008Forero, Quijano, et al., 2008Frerot, Velluz, et al., 2008Kumazawa, Itobe, et al., 2008
Comment MSDC-RI MSDC-RI MSDC-RI MSDC-RI MSDC-RI
Column type CapillaryCapillaryCapillaryCapillaryCapillary
Active phase SLB-5 MSHP-5HP-5 MSDB-5DB-5
Column length (m) 30.10.30.30.60.
Carrier gas HeliumHeliumHeliumHeHelium
Substrate
Column diameter (mm) 0.250.100.250.250.32
Phase thickness (μm) 0.250.400.250.251.0
Tstart (C) 50.40.50.35.35.
Tend (C) 250.280.230.220.240.
Heat rate (K/min) 3.20.3.3.15.
Initial hold (min) 2.1.10. 7.
Final hold (min) 10.1.10.40.10.
I 849.861.855.842.854.
ReferenceLo Presti, Sciarrone, et al., 2008Mildner-Szkudlarz and Jelen, 2008Adams, Beauchamp, et al., 2007El-Ghorab A., El-Massry K.F., et al., 2007Gogus, Ozel, et al., 2007
Comment MSDC-RI MSDC-RI MSDC-RI MSDC-RI MSDC-RI
Column type CapillaryCapillaryCapillaryCapillaryCapillary
Active phase CP Sil 8 CBDB-5DB-5HP-5HP-5
Column length (m) 30.30.30.25.25.
Carrier gas HeliumHelium
Substrate
Column diameter (mm) 0.250.250.250.20.2
Phase thickness (μm) 0.250.250.250.320.32
Tstart (C) 50.60.40.40.40.
Tend (C) 280.220.210.250.250.
Heat rate (K/min) 5.4.2.5.5.
Initial hold (min) 3.  1.1.
Final hold (min)   33.
I 860.857.855.857.861.
ReferenceMarques, Wendler, et al., 2007Morteza-Semnani, Saeedi, et al., 2007Sylvestre, Longtin, et al., 2007Tapia, Perich, et al., 2007Tapia, Perich, et al., 2007
Comment MSDC-RI MSDC-RI MSDC-RI MSDC-RI MSDC-RI
Column type CapillaryCapillaryCapillaryCapillaryCapillary
Active phase Elite-5MSHP-5 MSHP-1Ultra-2DB-1
Column length (m) 30.30.50.25.60.
Carrier gas HeHeliumN2H2Nitrogen
Substrate
Column diameter (mm) 0.320.250.20.250.25
Phase thickness (μm) 0.50.250.330.33
Tstart (C) 40.60.60.40.40.
Tend (C) 280.280.250.280.200.
Heat rate (K/min) 4.3.2.3.2.
Initial hold (min) 5.  2.1.
Final hold (min) 10. 20.10.9.
I 852.855.825.853.826.
ReferenceTava, Pecetti, et al., 2007Tsokou, Georgopoulos, et al., 2007Berlioz, Cordella, et al., 2006Ceva-Antunes, Bizzo, et al., 2006Chen, Sheu, et al., 2006
Comment MSDC-RI MSDC-RI MSDC-RI MSDC-RI MSDC-RI
Column type CapillaryCapillaryCapillaryCapillaryCapillary
Active phase HP-5MSHP-5HP-5DB-5SPB-5
Column length (m) 30.30.30.30.30.
Carrier gas  HeHeliumHeHelium
Substrate
Column diameter (mm) 0.250.250.320.250.25
Phase thickness (μm) 0.250.250.250.250.25
Tstart (C) 60.50.40.60.60.
Tend (C) 280.300.240.220.250.
Heat rate (K/min) 4.5.4.4.4.
Initial hold (min)  5. 5.2.
Final hold (min)  5.5. 20.
I 856.852.871.856.853.
ReferenceEbrahim Sajjadi and Mehregan, 2006Figuérédo, Cabassu, et al., 2006Miyazawa and Kawata, 2006Morteza-Semnani K., Saeedi M., et al., 2006Pino, Marquez, et al., 2006
Comment MSDC-RI MSDC-RI MSDC-RI MSDC-RI MSDC-RI
Column type CapillaryCapillaryCapillaryCapillaryCapillary
Active phase DB-5DB-5HP-5ZB-5DB-5 MS
Column length (m) 30.30.30.30.30.
Carrier gas HydrogenHydrogenH2He
Substrate
Column diameter (mm) 0.250.250.250.250.25
Phase thickness (μm) 0.250.250.250.250.25
Tstart (C) 70.70.50.40.40.
Tend (C) 280.280.280.300.200.
Heat rate (K/min) 4.4.4.2.8.
Initial hold (min) 4.4.2. 3.
Final hold (min)   10. 20.
I 854.854.854.853.844.
ReferencePino, Marbot, et al., 2006Pino, Marbot, et al., 2006Pino, Sauri-Duch, et al., 2006Sari M., Biondi D.M., et al., 2006Schirack, Drake, et al., 2006
Comment MSDC-RI MSDC-RI MSDC-RI MSDC-RI MSDC-RI
Column type CapillaryCapillaryCapillaryCapillaryCapillary
Active phase HP-1BPX5DB-5DB-5HP-5
Column length (m) 50.25.50.30.30.
Carrier gas HeHe HeHe
Substrate
Column diameter (mm) 0.20.200.30.250.25
Phase thickness (μm) 0.50.130.250.250.25
Tstart (C) 60.50.60.60.50.
Tend (C) 250.230.240.300.300.
Heat rate (K/min) 2.3.2.3.5.
Initial hold (min)  2. 3.5.
Final hold (min) 60.   5.
I 825.850.833.864.852.
ReferenceBendimerad and Bendiab, 2005Boustie, Rapior, et al., 2005Chagonda and Chalchat, 2005Ferraz, Limberger, et al., 2005Figuérédo, Cabassu, et al., 2005
Comment MSDC-RI MSDC-RI MSDC-RI MSDC-RI MSDC-RI
Column type CapillaryCapillaryCapillaryCapillaryCapillary
Active phase RTX-5SilBPX-5MDN-5DB-5HP-5MS
Column length (m) 30.30.60.30.30.
Carrier gas He HeHeHe
Substrate
Column diameter (mm) 0.250.250.250.250.25
Phase thickness (μm) 0.250.250.250.250.25
Tstart (C) 45.40.40.60.60.
Tend (C) 200.200.270.220.280.
Heat rate (K/min) 3.5.4.4.4.
Initial hold (min) 5.8.4.4.
Final hold (min)  10.5.
I 851.855.853.855.852.
ReferenceHolland, Larkov, et al., 2005Kalua, Allen, et al., 2005van Loon, Linssen, et al., 2005Morteza-Semnani and Saeedi, 2005Sajjadi S.E. and Eskandari B., 2005
Comment MSDC-RI MSDC-RI MSDC-RI MSDC-RI MSDC-RI
Column type CapillaryCapillaryCapillaryCapillaryCapillary
Active phase DB-1HP-5MSHP-1DB-5DB-5
Column length (m) 30.30.50.30.25.
Carrier gas HeHeN2HeNitrogen
Substrate
Column diameter (mm) 0.250.250.20.250.25
Phase thickness (μm) 0.250.250.330.250.25
Tstart (C) 50.60.60.60.60.
Tend (C) 265.280.250.240.240.
Heat rate (K/min) 2.53.2.2.3.
Initial hold (min) 1.5.
Final hold (min) 20. 20.
I 824.854.827.855.840.
ReferenceSarkhail, Amin, et al., 2005Setzer, Noletto, et al., 2005Cavalli, Fernandez, et al., 2004Cicció, 2004JAvidnia, Mojab, et al., 2004
Comment MSDC-RI MSDC-RI MSDC-RI MSDC-RI MSDC-RI
Column type CapillaryCapillaryCapillaryCapillaryCapillary
Active phase SE-54DB-1DB-1DB-1HP-5
Column length (m) 30.60.60.30.25.
Carrier gas HeHeHeHeN2
Substrate
Column diameter (mm) 0.250.320.320.250.2
Phase thickness (μm) 0.250.250.250.250.5
Tstart (C) 60.35.35.50.30.
Tend (C) 260.230.230.265.280.
Heat rate (K/min) 2.2.2.2.53.
Initial hold (min) 5.4.4.1.
Final hold (min)  25.25.20.
I 848.822.822.824.851.
ReferenceKilic, Hafizoglu, et al., 2004Park, Lee, et al., 2004Park, Lee, et al., 2004Sarkhail, Amin, et al., 2004Shafi, Nambiar, et al., 2004
Comment MSDC-RI MSDC-RI MSDC-RI MSDC-RI MSDC-RI
Column type CapillaryCapillaryCapillaryCapillaryCapillary
Active phase SE-54HP-5DB-5HP-5MSRSL-200
Column length (m) 30.25.60.30.30.
Carrier gas N2HeHeHeH2
Substrate
Column diameter (mm) 0.250.20.250.250.32
Phase thickness (μm) 0.250.330.250.250.25
Tstart (C) 40.40.35.60.40.
Tend (C) 200.190.280.275.280.
Heat rate (K/min) 5.4.5.4.6.
Initial hold (min) 4. 2. 5.
Final hold (min) 10.5.4. 5.
I 855.837.850.850.829.
ReferenceTura, Prenzler, et al., 2004Azodanlou, Darbellay, et al., 2003Dhanda, Pegg, et al., 2003Ghannadi, Aghazari, et al., 2003Jirovetz, Buchbauer, et al., 2003
Comment MSDC-RI MSDC-RI MSDC-RI MSDC-RI MSDC-RI
Column type CapillaryCapillaryCapillaryCapillaryCapillary
Active phase MDN-5HP-5DB-5DB-5DB-5
Column length (m) 30.30.30.30.30.
Carrier gas HeHeliumH2HeH2
Substrate
Column diameter (mm) 0.250.320.250.250.3
Phase thickness (μm) 0.25 0.250.250.25
Tstart (C) 40.70.60.60.35.
Tend (C) 280.210.280.240.240.
Heat rate (K/min) 20.2.4.3.8.
Initial hold (min) 1. 10. 2.5
Final hold (min) 1.60.40. 2.
I 861.852.854.851.850.
ReferenceMildner-Szkudlarz, Jelen, et al., 2003Mookdasanit, Tamura, et al., 2003Pino, Marbot, et al., 2003da Silva, Luz, et al., 2003Triqui and Bouchriti, 2003
Comment MSDC-RI MSDC-RI MSDC-RI MSDC-RI MSDC-RI
Column type CapillaryCapillaryCapillaryCapillaryCapillary
Active phase HP-1SPB-1SPB-1SPB-1HP-5
Column length (m) 50.30.30.30.30.
Carrier gas HeHeHeHeH2
Substrate
Column diameter (mm) 0.20.250.250.250.32
Phase thickness (μm) 0.50.250.250.250.25
Tstart (C) 60.40.40.40.45.
Tend (C) 220.200.200.200.230.
Heat rate (K/min) 2.3.3.3.3.
Initial hold (min)  10.10.10.1.
Final hold (min) 40.   10.
I 823.824.824.824.881.
ReferenceValette, Fernandez, et al., 2003Vichi, Castellote, et al., 2003Vichi, Pizzale, et al., 2003Vichi, Pizzale, et al., 2003, 2Darriet, Pons, et al., 2002
Comment MSDC-RI MSDC-RI MSDC-RI MSDC-RI MSDC-RI
Column type CapillaryCapillaryCapillaryCapillaryCapillary
Active phase DB-5RSL-200RSL-200DB-5DB-5
Column length (m) 30.30.30.30.30.
Carrier gas HeH2H2HeHe
Substrate
Column diameter (mm) 0.250.320.250.250.32
Phase thickness (μm) 0.250.250.250.250.25
Tstart (C) 60.40.40.60.40.
Tend (C) 240.280.280.240.290.
Heat rate (K/min) 3.6.6.3.7.
Initial hold (min)  5.2.
Final hold (min)  5.10.
I 854.830.830.853.852.
ReferenceFlamini, Ertugrul, et al., 2002Jirovetz, Buchbauer, et al., 2002Jirovetz, Smith, et al., 2002Kobaisy, Tellez, et al., 2002Lin, Rouseff, et al., 2002
Comment MSDC-RI MSDC-RI MSDC-RI MSDC-RI MSDC-RI
Column type CapillaryCapillaryCapillaryCapillaryCapillary
Active phase DB-5SPB-5DB-5HP-5HP-5
Column length (m) 30.30.30.30.30.
Carrier gas HeHeliumHeN2N2
Substrate
Column diameter (mm) 0.320.250.250.250.25
Phase thickness (μm) 0.250.250.250.250.25
Tstart (C) 40.60.60.60.60.
Tend (C) 290.250.240.220.220.
Heat rate (K/min) 7.4.3.5.5.
Initial hold (min)  2. 10.10.
Final hold (min)  20.
I 852.854.851.854.854.
ReferenceLin, Rouseff, et al., 2002Pino, Marbot, et al., 2002Tellez, Khan, et al., 2002Campeol, Flamini, et al., 2001Flamini, Cioni, et al., 2001
Comment MSDC-RI MSDC-RI MSDC-RI MSDC-RI MSDC-RI
Column type CapillaryCapillaryCapillaryCapillaryCapillary
Active phase RTX-1OV-101DB-5BP-1HP-5
Column length (m) 30.50.30.25.30.
Carrier gas N2N2H2N2He
Substrate
Column diameter (mm) 0.250.250.320.330.25
Phase thickness (μm) 0.25 0.51.00.25
Tstart (C) 60.80.60.60.60.
Tend (C) 300.200.245.275.275.
Heat rate (K/min) 4.2.3.4.4.
Initial hold (min)   3.
Final hold (min)   20.
I 831.827.854.853.853.
ReferenceKalemba, Marschall, et al., 2001Yang, 2001Kotseridis and Baumes, 2000Mohagheghzadeh, Shams-Ardakani, et al., 2000Mohagheghzadeh, Shams-Ardakani, et al., 2000, 2
Comment MSDC-RI MSDC-RI MSDC-RI MSDC-RI MSDC-RI
Column type CapillaryCapillaryCapillaryCapillaryCapillary
Active phase OV-101DB-5HP-1OV-101DB-5
Column length (m) 50.30.25.50.30.
Carrier gas NitrogenHeH2N2He
Substrate
Column diameter (mm) 0.250.250.320.20.25
Phase thickness (μm)  0.250.17 0.25
Tstart (C) 40.60.40.80.60.
Tend (C) 200.240.260.200.240.
Heat rate (K/min) 2.3.3.1.3.
Initial hold (min) 10. 5.
Final hold (min)    20.
I 826.853.829.830.854.
ReferenceTamura, Boonbumrung, et al., 2000Tellez, Dayan, et al., 2000Lopes, Koketsu, et al., 1999Menon, Chacko, et al., 1999Tellez, Canel, et al., 1999
Comment MSDC-RI MSDC-RI MSDC-RI MSDC-RI MSDC-RI
Column type CapillaryCapillaryCapillaryCapillaryCapillary
Active phase SE-54CBP-1HP-1HP-1Ultra-1
Column length (m) 25.30.25.25.50.
Carrier gas  He  He
Substrate
Column diameter (mm) 0.310.250.320.320.2
Phase thickness (μm)
Tstart (C) 35.60.35.35.40.
Tend (C) 250.240.250.250.240.
Heat rate (K/min) 4.4.4.4.4.
Initial hold (min) 3.
Final hold (min)     10.
I 844.854.832.824.844.
ReferenceDing, Deng, et al., 1998Lamarque, Maestri, et al., 1998Ong and Acree, 1998Ong, Acree, et al., 1998Hashizume and Samuta, 1997
Comment MSDC-RI MSDC-RI MSDC-RI MSDC-RI MSDC-RI
Column type CapillaryCapillaryCapillaryCapillaryCapillary
Active phase DB-5OV-101SPB-1OV-101OV-101
Column length (m) 30.50.50.15.15.
Carrier gas HeliumHeHeHeHe
Substrate
Column diameter (mm) 0.250.250.20.320.32
Phase thickness (μm) 0.25 0.33
Tstart (C) 60.50.40.35.35.
Tend (C) 240.250.200.250.250.
Heat rate (K/min) 3.2.3.6.6.
Initial hold (min)   3.3.3.
Final hold (min)   30.
I 855.828.822.826.828.
ReferenceTellez, Estell, et al., 1997Orav, Kailas, et al., 1996Wong and Lai, 1996Chisholm, Guiher, et al., 1995Chisholm, Guiher, et al., 1995
Comment MSDC-RI MSDC-RI MSDC-RI MSDC-RI MSDC-RI
Column type CapillaryCapillaryCapillaryCapillaryCapillary
Active phase DB-5 MSHP-101OV-101DB-1DB-1
Column length (m) 30.50.50.30.30.
Carrier gas HeliumH2 HeHe
Substrate
Column diameter (mm) 0.250.320.220.250.25
Phase thickness (μm)  0.3 0.250.25
Tstart (C) 50.65.80.50.50.
Tend (C) 250.300.200.240.240.
Heat rate (K/min) 4.2.2.5.5.
Initial hold (min)  5. 3.3.
Final hold (min)
I 848.823.832.825.826.
ReferenceGomez and Ledbetter, 1994Demarne and van der Walt, 1993Egolf and Jurs, 1993Shiota, 1993Shiota, 1993
Comment MSDC-RI MSDC-RI MSDC-RI MSDC-RI MSDC-RI
Column type CapillaryCapillaryCapillaryCapillaryCapillary
Active phase OV-101OV-101DB-1DB-5DB-5
Column length (m) 50.50.60.60.60.
Carrier gas     He
Substrate
Column diameter (mm) 0.250.250.320.250.25
Phase thickness (μm)    0.25
Tstart (C) 80.80.30.40.40.
Tend (C) 200.200.200.250.160.
Heat rate (K/min) 2.2.4.2.2.
Initial hold (min)   25.5.5.
Final hold (min)   20.
I 827.827.822.856.860.
ReferenceTamura, Yang, et al., 1993Tamura, Yang, et al., 1993Hansen, Buttery, et al., 1992Lee, Macku, et al., 1991Macku and Shibamoto, 1991
Comment MSDC-RI MSDC-RI MSDC-RI MSDC-RI MSDC-RI
Column type CapillaryCapillaryCapillaryCapillaryCapillary
Active phase DB-1DB-1DB-1DB-1DB-1
Column length (m) 60. 60.60.60.
Carrier gas     He
Substrate
Column diameter (mm) 0.32 0.32 0.25
Phase thickness (μm)
Tstart (C) 50.50.50.30.30.
Tend (C) 230.230.230.200.200.
Heat rate (K/min) 4.4.4.4.4.
Initial hold (min)    25.25.
Final hold (min) 10.10.10.30.5.
I 822.822.823.844.822.
ReferenceBinder, Benson, et al., 1990Binder, Turner, et al., 1990Binder, Turner, et al., 1990, 2Buttery, Takeoka, et al., 1990Buttery, Teranishi, et al., 1990
Comment MSDC-RI MSDC-RI MSDC-RI MSDC-RI MSDC-RI
Column type CapillaryCapillaryCapillaryCapillaryCapillary
Active phase OV-101OV-101OV-101OV-101DB-1
Column length (m) 50.50.50.50.60.
Carrier gas NitrogenNitrogenN2N2
Substrate
Column diameter (mm) 0.250.250.250.250.32
Phase thickness (μm)
Tstart (C) 70.80.80.80.50.
Tend (C) 200.200.200.200.250.
Heat rate (K/min) 2.2.2.2.4.
Initial hold (min)
Final hold (min)     5.
I 826.830.827.827.823.
ReferenceSugisawa, Nakamura, et al., 1990Sugisawa, Nakamura, et al., 1990Yang and Sugisawa, 1990Yang and Sugisawa, 1990Binder, Flath, et al., 1989
Comment MSDC-RI MSDC-RI MSDC-RI MSDC-RI MSDC-RI
Column type CapillaryCapillaryCapillaryCapillaryCapillary
Active phase DB-1OV-101OV-101OV-101DB-1
Column length (m) 60.50.50.50.60.
Carrier gas  N2N2N2He
Substrate
Column diameter (mm) 0.320.250.250.250.315
Phase thickness (μm)     0.25
Tstart (C) 50.80.80.80.50.
Tend (C) 250.200.200.200.250.
Heat rate (K/min) 4.2.2.2.4.
Initial hold (min) 0.1
Final hold (min) 5.
I 824.827.825.827.822.
ReferenceBinder and Flath, 1989Sugisawa, Yamamoto, et al., 1989Sugisawa, Yang, et al., 1989Sugisawa, Yang, et al., 1989Engel, Flath, et al., 1988
Comment MSDC-RI MSDC-RI MSDC-RI MSDC-RI MSDC-RI
Column type CapillaryCapillaryCapillaryCapillaryCapillary
Active phase OV-1OV-3DB-1OV-101OV-101
Column length (m) 50.150.50.50.50.
Carrier gas Hydrogen
Substrate
Column diameter (mm) 0.200.660.320.320.32
Phase thickness (μm)
Tstart (C) 50.20.0.40.50.
Tend (C) 200.170.250.225.225.
Heat rate (K/min) 1.1.3.4.4.
Initial hold (min)    0.10.1
Final hold (min) 35.  30.30.
I 817.880.824.824.823.
ReferenceWu, Liou, et al., 1987Buttery, Xu, et al., 1985Habu, Flath, et al., 1985Stern, Flath, et al., 1985Stern, Flath, et al., 1985
Comment MSDC-RI MSDC-RI MSDC-RI MSDC-RI MSDC-RI
Column type CapillaryCapillary
Active phase OV-101SE-30
Column length (m) 50.50.
Carrier gas He
Substrate
Column diameter (mm) 0.310.5
Phase thickness (μm)
Tstart (C) 0.40.
Tend (C) 225.170.
Heat rate (K/min) 3.3.
Initial hold (min) 1.3.
Final hold (min)
I 825.825.
Referencedel Rosario, de Lumen, et al., 1984Heydanek and McGorrin, 1981
Comment MSDC-RI MSDC-RI

Van Den Dool and Kratz RI, non-polar column, custom temperature program

Data compiled by: NIST Mass Spectrometry Data Center, William E. Wallace, director

Column type CapillaryCapillaryCapillaryCapillaryCapillary
Active phase BPX-5DB-5DB-5MSDB-5DB-5MS
Column length (m) 30.30.30.30.30.
Carrier gas He HeHeHe
Substrate
Column diameter (mm) 0.250.250.320.320.25
Phase thickness (μm) 0.250.250.51.0.25
Program 35C => 4C/min => 200C => 30C/min => 300C (3min)40C(2min) => 4C/min => 220C => 20C/min => 280C70C(1min) => 3C/min => 80C(1min) => 5C/min => 150C => 10C/min => 280C (4min)40C(2min) => 5C/min => 100C => 4C/min => 230C (10min)40 (5min) => 4C/min => 140C => 4C/min => 200C (20min)
I 859.850.865.851.855.
ReferenceDharmawan, Kasapis, et al., 2007Sampaio and Nogueira, 2006Varlet V., Knockaert C., et al., 2006Wang, Finn, et al., 2005Zheng, Kim, et al., 2005
Comment MSDC-RI MSDC-RI MSDC-RI MSDC-RI MSDC-RI
Column type CapillaryCapillaryCapillaryCapillaryCapillary
Active phase DB-5MSDB-5HP-5DB-5MSDB-5MS
Column length (m) 30.30.50.30.30.
Carrier gas HeHeHeHeHe
Substrate
Column diameter (mm) 0.250.320.20.250.25
Phase thickness (μm) 0.251.0.50.250.25
Program 40 (5min) => 4C/min => 140C => 4C/min => 200C (20min)40C (2min) => 5C/min => 100C => 4C/min => 230C (10min)40C(3min) => 10C/min => 60C =3C/min => 150C => 20C/min => 250C (5min)40C(5min) => 4C/min => 160C => 8C/min => 240C (15min)40C(5min) => 4C/min => 160C => 8C/min => 240C (15min)
I 857.851.861.857.853.
ReferenceZheng, Kim, et al., 2005Klesk, Qian, et al., 2004Boué, Shih, et al., 2003Kim, Lee, et al., 2003Kim, Lee, et al., 2003
Comment MSDC-RI MSDC-RI MSDC-RI MSDC-RI MSDC-RI
Column type CapillaryCapillaryCapillaryCapillaryCapillary
Active phase DB-5DB-5DB-5HP-5HP-5
Column length (m) 30.30.60.50.50.
Carrier gas HeHeHe
Substrate
Column diameter (mm) 0.250.320.320.320.32
Phase thickness (μm) 0.251.1.1.051.05
Program 40C(2min) => 5C/min => 100C => 4C/min => 230C(10min)40C(2min) => 2C/min => 100C => 10C/min => 230C (5min)40 C(4min) => 2C/min => 90C => 4C/min => 130C => 8C/min => 250C35C (5min) => 10C/min => 150C => 20C/min => 250C (10min)35C(5min) => 10C/min => 150C => 20C/min => 250C(10 min)
I 874.846.859.857.857.
ReferenceKlesk and Qian, 2003Klesk and Qian, 2003, 2Mayr, van Ruth, et al., 2003Carrapiso, Jurado, et al., 2002Carrapiso, Ventanas, et al., 2002
Comment MSDC-RI MSDC-RI MSDC-RI MSDC-RI MSDC-RI
Column type CapillaryCapillaryCapillaryCapillaryCapillary
Active phase CP Sil 8 CBCP Sil 8 CBDB-5CP-Sil 8CB-MSDB-5
Column length (m) 25.60.30.60.30.
Carrier gas HeHeHeHeH2
Substrate
Column diameter (mm) 0.320.250.250.250.25
Phase thickness (μm) 0.250.250.250.250.25
Program 35C(2min) => 5C/min => 170C => 20C/min => 240C (10min)0C => rapidly => 40C(8min) => 4C/min => 250C(10min)50C (1min) => 5C/min => 100C => 10C/min => 250C (9min)0C(5min) => 40C/min => 40C (2min) => 4C/min => 280C40C(5min) => 2C/min => 220C => 5C/min => 250C(15min)
I 850.860.850.857.853.
ReferenceFuhrmann and Grosch, 2002Oruna-Concha, Bakker, et al., 2002Beaulieu and Grimm, 2001Elmore, Mottram, et al., 2000Boulanger, Chassagne, et al., 1999
Comment MSDC-RI MSDC-RI MSDC-RI MSDC-RI MSDC-RI
Column type CapillaryCapillaryCapillaryCapillaryCapillary
Active phase DB-5DB-5DB-5SE-54SE-54
Column length (m) 30.30.30.30.30.
Carrier gas H2H2H2HeHe
Substrate
Column diameter (mm) 0.250.250.250.320.32
Phase thickness (μm) 0.250.250.250.250.25
Program 40C(5min) => 2C/min => 220C => 5C/min => 250C(15min)40C(5min) => 2C/min => 220C => 5C/min => 250C(15min)40C(5min) => 2C/min => 220C => 5C/min => 250C(15min)35C (2min) => 40C/min => 50C => 4C/min => 230C (10min)35C(2min) => 40C/min => 50C(2min) => 6C/min => 180C => 10C/min => 230C(10 min)
I 854.854.858.853.853.
ReferenceBoulanger, Chassagne, et al., 1999Boulanger, Chassagne, et al., 1999Boulanger, Chassagne, et al., 1999Derail, Hofmann, et al., 1999Hinterholzer, Lemos, et al., 1998
Comment MSDC-RI MSDC-RI MSDC-RI MSDC-RI MSDC-RI
Column type CapillaryCapillaryCapillaryCapillaryCapillary
Active phase BPX-5DB-5SE-54SE-54DB-1
Column length (m) 50.30.  15.
Carrier gas HeHe  He
Substrate
Column diameter (mm) 0.320.25  0.32
Phase thickness (μm) 0.51.
Program 0C (10min) => 40C/min => 40C (2min) => 4C/min => 280C35C (2min) => 40C/min => 50C (1min) => 6C/min => 250C (10min)35C (2min) => 40C/min => 50C (1min) => 6C/min => 250C (10min)not specifiednot specified
I 867.862.856.851.824.
ReferenceElmore, Mottram, et al., 1997Triqui and Reineccius, 1995Triqui and Reineccius, 1995Ullrich and Grosch, 1988Mikolajczak, Zilkowski, et al., 1984
Comment MSDC-RI MSDC-RI MSDC-RI MSDC-RI MSDC-RI

Kovats' RI, non-polar column, isothermal

Data compiled by: NIST Mass Spectrometry Data Center, William E. Wallace, director

Column type CapillaryCapillary
Active phase SE-30SE-30
Column length (m)  40.
Carrier gas
Substrate
Column diameter (mm)  0.35
Phase thickness (μm)  0.35
Temperature (C) 100.100.
I 831.830.6
ReferenceTudor and Moldovan, 1999Tudor, 1997
Comment MSDC-RI MSDC-RI

Normal alkane RI, polar column, custom temperature program

Data compiled by: NIST Mass Spectrometry Data Center, William E. Wallace, director

Column type CapillaryCapillaryCapillaryCapillaryCapillary
Active phase DB-WaxDB-WaxInnowaxDB-WaxSupelko CO Wax
Column length (m) 60.60.60.30.60.
Carrier gas HeliumHelium HydrogenHelium
Substrate
Column diameter (mm) 0.200.250.250.250.32
Phase thickness (μm) 0.250.500.330.250.25
Program 40 0C (3 min) 2 0C/min -> 150 0C 4 0C/min -> 220 0C (20 min) 5 0C/min -> 230 0C40 0C 4 0C/min -> 230 0C 100 0C/min -> 260 0C (11.7 min)not specified35 0C (9 min) 5 0C/min -> 80 0C 1 0C/min -> 100 0C 16 0C/min -> 210 0C (20 min)40 0C (5 min) 4 0C/min -> 75 0C 5 0C/min -> 250 0C (10 min)
I 1214.1233.1209.1209.1229.
ReferenceGyawali and Kim, 2012Miyazaki, Plotto, et al., 2011Noorizadeh, Farmany, et al., 2011Sampaio, Garruti, et al., 2011Vekiari, Orepoulou, et al., 2010
Comment MSDC-RI MSDC-RI MSDC-RI MSDC-RI MSDC-RI
Column type CapillaryCapillaryCapillaryCapillaryCapillary
Active phase Supelko CO WaxInnowax FSCDB-WaxDB-WaxCP-Wax 52 CB
Column length (m) 60.60.30.30.60.
Carrier gas HeliumHeliumHeliumHeliumHelium
Substrate
Column diameter (mm) 0.320.250.250.250.25
Phase thickness (μm) 0.250.250.250.250.25
Program not specified60 0C (10 min) 4 0C/min -> 220 0C (10 min) 1 0C/min -> 240 0C40 0C (4 min) 2.5 0C/min -> 80 0C 5 0C/min -> 110 0C 10 0C/min -> 220 0C (5 min)not specified45 0C (5 min) 3 0C/min -> 150 0C 10 0C/min -> 240 0C
I 1228.1232.1218.1212.1224.
ReferenceVekiari, Orepoulou, et al., 2010Baser, Demirci, et al., 2009Canuti, Conversano, et al., 2009Canuti, Conversano, et al., 2009Romeo, Verzera, et al., 2009
Comment MSDC-RI MSDC-RI MSDC-RI MSDC-RI MSDC-RI
Column type CapillaryCapillaryCapillaryCapillaryCapillary
Active phase DB-WaxHP-FFAPSupelcowax-10HP-InnowaxCarbowax 20M
Column length (m) 30.30.30.60.50.
Carrier gas Helium HeNitrogenH2
Substrate
Column diameter (mm) 0.320.320.250.250.32
Phase thickness (μm) 0.500.250.250.250.5
Program 40 0C 7 0C/min -> 110 0C 15 0C/min -> 250 0C (3 min)35 0C (10 min) 10 0C/min -> 150 0C 20 0C/min -> 250 0C (10 min)40C(3min) => 4C/min => 75C => 8C/min => 250C(5min)50 0C (4 min) -> 40 0C 4 0C/min -> 220 0C25C(7min) => 0.8C/min => 33C => 2.4C/min => 80C => 3.7C/min => 155C (20min)
I 1227.1224.1228.1218.1213.
ReferenceValappil, Fan, et al., 2009Carrapiso and Garsia, 2007Vichi, Guadayol, et al., 2007Quijano and Pino, 2006Dhifi, Angerosa, et al., 2005
Comment MSDC-RI MSDC-RI MSDC-RI MSDC-RI MSDC-RI
Column type CapillaryCapillaryCapillaryCapillaryCapillary
Active phase HP Innowax FSPDB-WaxDB-WaxDB-WaxBP-21
Column length (m) 60.60.60.30.50.
Carrier gas N2 HeliumHeHe
Substrate
Column diameter (mm) 0.250.250.250.320.22
Phase thickness (μm) 0.25 0.250.50.25
Program 60C(10min) => 4C/min => 220C(10min) => 1C/min => 240Cnot specified60 0C (3 min) 2 0C/min -> 150 0C 4 0C/min -> 200 0C40C => 1C/min => 57C => 15C/min => 230C (5min)50C => 2.5C/min => 180C(2min) => 1C/min => 200C(10min)
I 1232.1214.1211.1224.1207.
ReferenceAltintas, Kose, et al., 2004Buttery and Takeoka, 2004Kim. J.H., Ahn, et al., 2004le Pape, Grua-Priol, et al., 2004Salinas, Zalacain, et al., 2004
Comment MSDC-RI MSDC-RI MSDC-RI MSDC-RI MSDC-RI
Column type CapillaryCapillaryCapillaryCapillaryCapillary
Active phase Carbowax 20MHP-Innowax FSCHP-Innowax FSCPEG-20MInnowax FSC
Column length (m)  60.60.30.60.
Carrier gas  HeHe
Substrate
Column diameter (mm)  0.250.250.250.25
Phase thickness (μm)  0.250.250.250.25
Program not specified60C (10min) => 4C/min => 220C (10min) => 1C/min => 240C60C(10min) => 4C/min => 220C(10min) => 1C/min => 240C50C(8min) => 4C/min => 110C => 16C/min => 200C60C(10min) => 4C/min => 220C(10min) => 1C/min => 240C
I 1207.1232.1232.1214.1232.
ReferenceVinogradov, 2004Demirci, Baser, et al., 2003Demirci, Demirci, et al., 2003Garruti, Franco, et al., 2003Tunalier, Kirimer, et al., 2002
Comment MSDC-RI MSDC-RI MSDC-RI MSDC-RI MSDC-RI
Column type CapillaryCapillaryCapillaryCapillaryCapillary
Active phase HP-InnowaxHP-Innowax FSCInnowax FSCDB-WaxDB-Wax
Column length (m) 60.60.60.60.60.
Carrier gas He HeHeliumHe
Substrate
Column diameter (mm) 0.250.250.250.320.32
Phase thickness (μm) 0.250.250.250.250.5
Program 60 0C (10 min) 4 K/min -> 220 0C (10 min) 1 K/min -> 240 0C60C(10min) => 4C/min => 220C(10min) => 1C/min => 240C60C(10 min) => 4C/min => 220C(10min) => 1C/min => 240Cnot specified50C(6min) => 1C/min => 130C => 10C/min => 240C (15min)
I 1232.1232.1232.1210.1228.
ReferenceGören, Demirci, et al., 2001Tabanca, Kirimer, et al., 2001Kirimer, Tabanca, et al., 2000Paniandy, Chane-Ming, et al., 2000Piveteau, le Guen, et al., 2000
Comment MSDC-RI MSDC-RI MSDC-RI MSDC-RI MSDC-RI
Column type CapillaryCapillaryCapillaryCapillaryCapillary
Active phase Innowax FSCSupelcowax-10CP-Wax 52CBFFAPDB-Wax
Column length (m) 60.60.50.25.60.
Carrier gas HeliumHeHe He
Substrate
Column diameter (mm) 0.250.530.250.320.25
Phase thickness (μm) 0.251.0.20.3
Program 60 0C (10 min) 4 0C/min -> 220 0C (10 min) 1 0C/min -> 240 0C40C (2min) => 16C/min => 120C => 15C/min => 240C(3min)30C (1.5min) => 3C/min => 120C => 10C/min => 220C (3.5min)35C (2min) => 40C/min => 60C(1min) => 6C/min => 230C45C(4min) => 30C/min => 60C (5min) => 3C/min => 220C(40min)
I 1232.1246.1216.1215.1223.
ReferenceKirimer, Tabanca, et al., 1999Forney and Jordan, 1998Jakobsen, Hansen, et al., 1998Reiners and Grosch, 1998Ziegleder, 1998
Comment MSDC-RI MSDC-RI MSDC-RI MSDC-RI MSDC-RI
Column type CapillaryCapillaryCapillaryCapillaryCapillary
Active phase CP-Wax 52CBSupelcowax 10Supelcowax 10Supelcowax 10CP-Wax 52 CB
Column length (m) 25.60.60.60.30.
Carrier gas H2HeliumHeliumHeliumH2
Substrate
Column diameter (mm) 0.30.250.250.250.32
Phase thickness (μm) 1.20.250.250.25
Program 60C(3min) => 2C/min => 220C => 3C/min => 245C60 0C (10 min) 2 0C/min -> 80 0C 3 0C/min -> 100 0C 4 0C/min -> 220 0C (30 min)not specifiednot specified60 0C 2 0C/min -> 220 0C 3 0C/min -> 245 0C
I 1243.1213.1218.1225.1243.
ReferenceLópez-Tamames, Carro-Mariño, et al., 1997Castioni and Kapetanidis, 1996Castioni and Kapetanidis, 1996Castioni and Kapetanidis, 1996Carro Marino, López Tamames, et al., 1995
Comment MSDC-RI MSDC-RI MSDC-RI MSDC-RI MSDC-RI
Column type CapillaryCapillaryCapillaryCapillaryCapillary
Active phase CP-Wax 52CBCP Wax 52 CBCP-Wax 52CBCP-Wax 52CBSupelcowax-10
Column length (m)  50.50.50.30.
Carrier gas
Substrate
Column diameter (mm)  0.320.320.320.25
Phase thickness (μm)  0.201.51.5
Program 40C => 2C/min => 150C => 10C/min => 250C50 0C (10 min) 2 0C/min -> 100 0C 5 0C/min -> 150 0C 7 0C/min -> 220 0C (20 min)40C => 2C/min => 150C => 10C/min => 250C40C => 2C/min => 150C => 10C/min => 250Cnot specified
I 1210.1208.1212.1212.1215.
ReferenceLuning, Carey, et al., 1995Patterson and Stevenson, 1995Luning, de Rijk, et al., 1994Luning, de Rijk, et al., 1994Jean, Garneau, et al., 1993
Comment MSDC-RI MSDC-RI MSDC-RI MSDC-RI MSDC-RI
Column type CapillaryCapillaryCapillary
Active phase DB-WaxDB-WaxDB-Wax
Column length (m) 60.60.60.
Carrier gas He
Substrate
Column diameter (mm) 0.250.320.32
Phase thickness (μm) 0.25
Program 35C (5min) => 2C/min => 50C => 5C/min => 200C(5min)not specifiednot specified
I 1216.1215.1215.
ReferenceMattheis, Buchanan, et al., 1992Binder, Flath, et al., 1989Binder and Flath, 1989
Comment MSDC-RI MSDC-RI MSDC-RI

Kovats' RI, polar column, temperature ramp

Data compiled by: NIST Mass Spectrometry Data Center, William E. Wallace, director

Column type CapillaryCapillaryCapillaryCapillaryCapillary
Active phase DB-WaxSupelcowax-10DB-WaxDB-WaxDB-Wax
Column length (m) 60.60.60.60.60.
Carrier gas HeHeHeHeHe
Substrate
Column diameter (mm) 0.250.250.250.250.25
Phase thickness (μm)   0.250.250.25
Tstart (C) 40.35.40.40.40.
Tend (C) 200.200.200.200.200.
Heat rate (K/min) 2.3.3.3.3.
Initial hold (min) 2.5.5.5.5.
Final hold (min)  20.
I 1216.1225.1219.1219.1218.
ReferenceUmano, Hagi, et al., 1994Wong and Teng, 1994Tatsuka, Suekane, et al., 1990Tatsuka, Suekane, et al., 1990Tatsuka, Suekane, et al., 1990
Comment MSDC-RI MSDC-RI MSDC-RI MSDC-RI MSDC-RI
Column type CapillaryCapillaryCapillaryCapillaryCapillary
Active phase DB-WaxCarbowax 20MDB-WaxDB-WaxDB-Wax
Column length (m) 60.50.60.30.30.
Carrier gas He HeN2N2
Substrate
Column diameter (mm) 0.250.220.250.250.25
Phase thickness (μm) 0.25
Tstart (C) 40.80.40.60.60.
Tend (C) 200.200.200.200.200.
Heat rate (K/min) 3.2.2.2.2.
Initial hold (min) 5. 10.10.10.
Final hold (min)
I 1219.1222.1212.1228.1222.
ReferenceTatsuka, Suekane, et al., 1990Nishimura, Yamaguchi, et al., 1989Umano and Shibamoto, 1987Umano, Shoji, et al., 1986Umano, Shoji, et al., 1986
Comment MSDC-RI MSDC-RI MSDC-RI MSDC-RI MSDC-RI
Column type CapillaryCapillaryCapillaryCapillary
Active phase Carbowax 20MCarbowax 20MCarbowax 20MCarbowax 20M
Column length (m) 59.150.70.70.
Carrier gas  HeN2N2
Substrate
Column diameter (mm) 0.250.640.280.28
Phase thickness (μm)
Tstart (C) 70.50.80.80.
Tend (C) 190.170.200.200.
Heat rate (K/min) 1.1.2.2.
Initial hold (min)  30.
Final hold (min)
I 1234.1230.1205.1208.
ReferencePalma-Fleming and Kepner, 1983Buttery, Kamm, et al., 1982Yamaguchi and Shibamoto, 1981Yamaguchi and Shibamoto, 1981
Comment MSDC-RI MSDC-RI MSDC-RI MSDC-RI

References

Weast and Grasselli, 1989
CRC Handbook of Data on Organic Compounds, 2nd Editon, Weast,R.C and Grasselli, J.G., ed(s)., CRC Press, Inc., Boca Raton, FL, 1989, 1. [all data]
Aldrich Chemical Company Inc., 1990
Aldrich Chemical Company Inc.,
Catalog Handbook of Fine Chemicals, Aldrich Chemical Company, Inc., Milwaukee WI, 1990, 1. [all data]