Benzene, (1-chloroethyl)-
- Formula: C8H9Cl
- Molecular weight: 140.610
- IUPAC Standard InChIKey: GTLWADFFABIGAE-UHFFFAOYSA-N
- CAS Registry Number: 672-65-1
- Chemical structure:
View 3d structure (requires JavaScript / HTML 5) - Other names: α-Methylbenzyl chloride; α-Phenethyl chloride; α-Phenylethyl chloride; (α-Chloroethyl)benzene; (1-Chloroethyl)benzene; 1-Chloro-1-phenylethane; 1-Phenyl-1-chloroethane; 1-Phenylethyl chloride

Condensed phase thermochemistry data

Data compiled by: Hussein Y. Afeefy, Joel F. Liebman, and Stephen E. Stein
Quantity | Value | Units | Method | Reference | Comment |
---|---|---|---|---|---|
ΔfH°liquid | -58.24 | kJ/mol | Ccr | Hu and Sinke, 1969 | |
Quantity | Value | Units | Method | Reference | Comment |
ΔcH°liquid | -4399.77 | kJ/mol | Ccr | Hu and Sinke, 1969 |

Phase change data

Data compiled as indicated in comments:
BS - Robert L. Brown and Stephen E. Stein
AC - William E. Acree, Jr., James S. Chickos
Quantity | Value | Units | Method | Reference | Comment |
---|---|---|---|---|---|
ΔvapH° | 52.8 ± 0.2 | kJ/mol | GS | Krasnykh, Vasiltsova, et al., 2002 | Based on data from 281. to 319. K.; AC |
ΔvapH° | 52.4 | kJ/mol | CGC | Krasnykh, Vasiltsova, et al., 2002 | AC |
Reduced pressure boiling point
Tboil (K) | Pressure (bar) | Reference | Comment |
---|---|---|---|
361. to 362. | 0.045 | Frinton Laboratories Inc., 1986 | BS |
Enthalpy of vaporization
ΔvapH (kJ/mol) | Temperature (K) | Method | Reference | Comment |
---|---|---|---|---|
51.4 | 351. | N/A | Dykyj, Svoboda, et al., 1999 | Based on data from 336. to 372. K.; AC |
47.0 | 357. | A | Stephenson and Malanowski, 1987 | Based on data from 342. to 378. K.; AC |

Reaction thermochemistry data

Data compiled by: Hussein Y. Afeefy, Joel F. Liebman, and Stephen E. Stein
Individual Reactions
By formula: C8H8 + HCl = C8H9Cl
Quantity | Value | Units | Method | Reference | Comment |
---|---|---|---|---|---|
ΔrH° | -55.6 ± 7.1 | kJ/mol | Cm | Nesterova, Kovzel, et al., 1977 | liquid phase; Hydrochlorination |

Van Den Dool and Kratz RI, non-polar column, temperature ramp

View large format table.

Column type Active phase I Reference Comment
CapillaryPetrocol DH1039.White, Hackett, et al., 1992100. m/0.25 mm/0.5 μm, He, 1. K/min; Tstart: 30. C; Tend: 220. C

Normal alkane RI, non-polar column, temperature ramp

View large format table.

Column type Active phase I Reference Comment
CapillarySE-301060.Krasnykh, Vasiltsova, et al., 2002Nitrogen, 30. C @ 5. min, 10. K/min; Column length: 25. m; Tend: 250. C
CapillaryOV-1011044.Zenkevich, 2001N2, 4. K/min; Column length: 25. m; Column diameter: 0.20 mm; Tstart: 60. C; Tend: 240. C

Normal alkane RI, non-polar column, custom temperature program

View large format table.

Column type Active phase I Reference Comment
CapillaryMethyl Silicone1051.Zenkevich, 1999Program: not specified

References

Hu and Sinke, 1969
Hu, A.T.; Sinke, G.C.,
Combustion calorimetry of some chlorinated organic compounds,
J. Chem. Thermodyn., 1969, 1, 507-513. [all data]
Krasnykh, Vasiltsova, et al., 2002
Krasnykh, Eugen L.; Vasiltsova, Tatiana V.; Verevkin, Sergey P.; Heintz, Andreas,
Vapor Pressures and Enthalpies of Vaporization of Benzyl Halides and Benzyl Ethers,
J. Chem. Eng. Data, 2002, 47, 6, 1372-1378, https://doi.org/10.1021/je020034h
. [all data]
Frinton Laboratories Inc., 1986
Frinton Laboratories Inc.,
Catalog Number 11, Frinton Laboratories Inc., Vineland, NJ, 1986, 99. [all data]
Dykyj, Svoboda, et al., 1999
Dykyj, J.; Svoboda, J.; Wilhoit, R.C.; Frenkel, M.L.; Hall, K.R.,
Vapor Pressure of Chemicals: Part A. Vapor Pressure and Antoine Constants for Hydrocarbons and Sulfur, Selenium, Tellurium and Hydrogen Containing Organic Compounds, Springer, Berlin, 1999, 373. [all data]
Stephenson and Malanowski, 1987
Stephenson, Richard M.; Malanowski, Stanislaw,
Handbook of the Thermodynamics of Organic Compounds, 1987, https://doi.org/10.1007/978-94-009-3173-2
. [all data]
Nesterova, Kovzel, et al., 1977
Nesterova, T.N.; Kovzel, E.N.; Karaseva, S.Ya.; Rozhnov, A.M.,
Heats of reaction of the hydrohalogenation of styrene and α-methylstyrene,
Vses. Konf. Kalorim. Rasshir. Tezisy Dokl. 7th, 1977, 1, 132. [all data]