Benzaldehyde, 2-hydroxy-5-methoxy-
- Formula: C8H8O3
- Molecular weight: 152.1473
- IUPAC Standard InChIKey: FZHSPPYCNDYIKD-UHFFFAOYSA-N
- CAS Registry Number: 672-13-9
- Chemical structure:
View 3d structure (requires JavaScript / HTML 5) - Other names: m-Anisaldehyde, 6-hydroxy-; 2-Formyl-4-methoxyphenol; 2-Hydroxy-5-methoxybenzaldehyde; 5-Methoxysalicylaldehyde; Salicylaldehyde, 5-methoxy-; 5-Methoxy-2-hydroxybenzaldehyde; Hmb; 6-Hydroxy-m-anisaldehyde

Phase change data

Data compiled by: Robert L. Brown and Stephen E. Stein
Quantity | Value | Units | Method | Reference | Comment |
---|---|---|---|---|---|
Tboil | 520.7 | K | N/A | Weast and Grasselli, 1989 |
Reduced pressure boiling point
Tboil (K) | Pressure (bar) | Reference |
---|---|---|
376.2 | 0.004 | Aldrich Chemical Company Inc., 1990 |

Van Den Dool and Kratz RI, non-polar column, custom temperature program

Column type | Active phase | I | Reference | Comment |
---|---|---|---|---|
Capillary | VF-5MS | 1318.6 | Tret'yakov, 2008 | 30. m/0.25 mm/0.25 μm, He; Program: Multi-step temperature program; T(initial)=60C; T(final)=270C |

References

Weast and Grasselli, 1989
CRC Handbook of Data on Organic Compounds, 2nd Editon, Weast,R.C and Grasselli, J.G., ed(s)., CRC Press, Inc., Boca Raton, FL, 1989, 1. [all data]
Aldrich Chemical Company Inc., 1990
Aldrich Chemical Company Inc.,
Catalog Handbook of Fine Chemicals, Aldrich Chemical Company, Inc., Milwaukee WI, 1990, 1. [all data]
Tret'yakov, 2008
Tret'yakov, K.V.,
Retention Data. NIST Mass Spectrometry Data Center., NIST Mass Spectrometry Data Center, 2008. [all data]