Bicyclo[3.1.1]hept-2-ene-2-methanol, 6,6-dimethyl-, (1S)-
- Formula: C10H16O
- Molecular weight: 152.2334
- IUPAC Standard InChIKey: RXBQNMWIQKOSCS-RKDXNWHRSA-N
- CAS Registry Number: 6712-78-3
- Chemical structure:

Phase change data

Data compiled by: Robert L. Brown and Stephen E. Stein
Reduced pressure boiling point
Tboil (K) | Pressure (atm) | Reference |
---|---|---|
376.7 | 0.014 | Weast and Grasselli, 1989 |

References

Weast and Grasselli, 1989
CRC Handbook of Data on Organic Compounds, 2nd Editon, Weast,R.C and Grasselli, J.G., ed(s)., CRC Press, Inc., Boca Raton, FL, 1989, 1. [all data]