1,5-Heptadiene, 2,6-dimethyl-
- Formula: C9H16
- Molecular weight: 124.2233
- IUPAC Standard InChIKey: DONSTYDPUORSDN-UHFFFAOYSA-N
- CAS Registry Number: 6709-39-3
- Chemical structure:
View 3d structure (requires JavaScript / HTML 5) - Other names: 2,6-Dimethyl-1,5-heptadiene; 2,6-dimethylhepta-1,5-diene

Phase change data

Data compiled by: Thermodynamics Research Center, NIST Boulder Laboratories, Chris Muzny director
Quantity | Value | Units | Method | Reference | Comment |
---|---|---|---|---|---|
Tboil | 415.1 | K | N/A | Henne and Chanan, 1944 | Uncertainty assigned by TRC = 2. K |
Tboil | 416. | K | N/A | Paul, 1941 | Uncertainty assigned by TRC = 2. K |
Quantity | Value | Units | Method | Reference | Comment |
Tfus | 170.5 | K | N/A | Henne and Chanan, 1944 | Uncertainty assigned by TRC = 2. K |

Normal alkane RI, non-polar column, temperature ramp

View large format table.

Column type Active phase I Reference Comment
CapillaryHP-5 MS829.Zhao, Zeng, et al., 200930. m/0.25 mm/0.25 μm, Helium, 4. K/min; Tstart: 50. C; Tend: 280. C

Normal alkane RI, non-polar column, custom temperature program

View large format table.

Column type Active phase I Reference Comment
CapillarySLB-5 MS882.Costa, De Fina, et al., 200830. m/0.25 mm/0.25 μm, Helium; Program: 50 0C 3 0C/min -> 250 0C (1 min) 10 0C/min -> 300 0C (5 min)

References

Henne and Chanan, 1944
Henne, A.L.; Chanan, H.H.,
Diolefins from Allylic Chlorides II.,
J. Am. Chem. Soc., 1944, 66, 392. [all data]
Paul, 1941
Paul, R.,
Bull. Soc. Chim. Fr., 1941, 8, 507. [all data]