Cyclohexane, (1-decylundecyl)-
- Formula: C27H54
- Molecular weight: 378.7177
- IUPAC Standard InChIKey: ZSEPDKTYQJRZIS-UHFFFAOYSA-N
- CAS Registry Number: 6703-99-7
- Chemical structure:
View 3d structure (requires JavaScript / HTML 5) - Other names: Heneicosane, 11-cyclohexyl-; 11-Cyclohexylheneicosane

Condensed phase thermochemistry data

Data compiled by: Hussein Y. Afeefy, Joel F. Liebman, and Stephen E. Stein
Quantity | Value | Units | Method | Reference | Comment |
---|---|---|---|---|---|
ΔfH°liquid | -690.7 ± 0.3 | kJ/mol | Ccb | Parks, West, et al., 1946 | |
ΔfH°liquid | -689.9 ± 7.2 | kJ/mol | Ccb | Knowlton and Huffman, 1944 | Reanalyzed by Cox and Pilcher, 1970, Original value = -691.6 kJ/mol |
Quantity | Value | Units | Method | Reference | Comment |
ΔcH°liquid | -17651.9 ± 7.1 | kJ/mol | Ccb | Parks, West, et al., 1946 | Corresponding ΔfHºliquid = -690.32 kJ/mol (simple calculation by NIST; no Washburn corrections) |
ΔcH°liquid | -17652.3 ± 7.1 | kJ/mol | Ccb | Knowlton and Huffman, 1944 | Reanalyzed by Cox and Pilcher, 1970, Original value = -17651. kJ/mol; Corresponding ΔfHºliquid = -689.90 kJ/mol (simple calculation by NIST; no Washburn corrections) |

Phase change data

Data compiled as indicated in comments:
TRC - Thermodynamics Research Center, NIST Boulder Laboratories, Chris Muzny director
AC - William E. Acree, Jr., James S. Chickos
Quantity | Value | Units | Method | Reference | Comment |
---|---|---|---|---|---|
Tfus | 265.95 | K | N/A | Anonymous, 1968 | Uncertainty assigned by TRC = 0.5 K; TRC |
Tfus | 266.0 | K | N/A | Foehr and Fenske, 1949 | Uncertainty assigned by TRC = 0.7 K; TRC |
Tfus | 266.5 | K | N/A | Parks, Moore, et al., 1949 | Uncertainty assigned by TRC = 0.7 K; TRC |
Tfus | 265.950 | K | N/A | Parks, West, et al., 1946, 2 | Uncertainty assigned by TRC = 0.4 K; TRC |
Quantity | Value | Units | Method | Reference | Comment |
Ttriple | 294.3 | K | N/A | Parks, Moore, et al., 1949 | Uncertainty assigned by TRC = 0.2 K; TRC |
Enthalpy of vaporization
ΔvapH (kJ/mol) | Temperature (K) | Method | Reference | Comment |
---|---|---|---|---|
107. | 500. | A | Stephenson and Malanowski, 1987 | Based on data from 485. to 529. K.; AC |

References

Parks, West, et al., 1946
Parks, G.S.; West, T.J.; Naylor, B.F.; Fujii, P.S.; McClaine, L.A.,
Thermal data on organic compounds. XXIII. Modern combustion data for fourteen hydrocarbons and five polyhydroxy alcohols,
J. Am. Chem. Soc., 1946, 68, 2524-2527. [all data]
Knowlton and Huffman, 1944
Knowlton, J.W.; Huffman, H.M.,
The heats of combustion of some substituted eicosanes, heneicosanes and docosanes,
J. Am. Chem. Soc., 1944, 66, 1492-1494. [all data]
Cox and Pilcher, 1970
Cox, J.D.; Pilcher, G.,
Thermochemistry of Organic and Organometallic Compounds, Academic Press, New York, 1970, 1-636. [all data]
Anonymous, 1968
Anonymous, R.,
Properties of hydrocarbon of high molecular weight, Am. Pet. Inst. Res. Proj. 42, Penn. State Univ., 1968. [all data]
Foehr and Fenske, 1949
Foehr, E.G.; Fenske, M.R.,
Magneto-optic Rotation of Hydrocarbons,
Ind. Eng. Chem., 1949, 41, 1956. [all data]
Parks, Moore, et al., 1949
Parks, G.S.; Moore, G.E.; Renquist, M.L.; Naylor, B.F.; McClaine, L.A.; Fujii, P.S.; Hatton, J.A.,
Thermal Data on Organic Compounds. XXV. Some Heat Capacity, Entropy and Free Energy Data for Nine Hydrocarbons of High Molecular Weight,
J. Am. Chem. Soc., 1949, 71, 10, 3386, https://doi.org/10.1021/ja01178a034
. [all data]
Parks, West, et al., 1946, 2
Parks, G.S.; West, T.J.; Naylor, B.F.; Fujii, P.S.; McClaine, L.A.,
Thermal Data on Organic Compounds XXIII. Modern Combustion Data for Fourteen Hydrocarbons and Five Polyhydric Alcohols,
J. Am. Chem. Soc., 1946, 68, 2524. [all data]
Stephenson and Malanowski, 1987
Stephenson, Richard M.; Malanowski, Stanislaw,
Handbook of the Thermodynamics of Organic Compounds, 1987, https://doi.org/10.1007/978-94-009-3173-2
. [all data]