Heneicosane, 11-cyclopentyl-
- Formula: C26H52
- Molecular weight: 364.6911
- IUPAC Standard InChIKey: LEQBWYDHNLNMED-UHFFFAOYSA-N
- CAS Registry Number: 6703-81-7
- Chemical structure:
View 3d structure (requires JavaScript / HTML 5) - Other names: Cyclopentane, (1-decylundecyl)-; 11-Cyclopentylheneicosane

Phase change data

Data compiled as indicated in comments:
TRC - Thermodynamics Research Center, NIST Boulder Laboratories, Chris Muzny director
AC - William E. Acree, Jr., James S. Chickos
Quantity | Value | Units | Method | Reference | Comment |
---|---|---|---|---|---|
Tfus | 260.45 | K | N/A | Anonymous, 1968 | Uncertainty assigned by TRC = 0.5 K; TRC |
Tfus | 260.5 | K | N/A | Foehr and Fenske, 1949 | Uncertainty assigned by TRC = 1.5 K; TRC |
Tfus | 260.5 | K | N/A | Schiessler, 1947 | Uncertainty assigned by TRC = 1.5 K; TRC |
Enthalpy of vaporization
ΔvapH (kJ/mol) | Temperature (K) | Method | Reference | Comment |
---|---|---|---|---|
92.4 | 501. | A,MG | Stephenson and Malanowski, 1987 | Based on data from 486. to 524. K. See also Schiessler and Whitmore, 1955.; AC |

Normal alkane RI, non-polar column, custom temperature program

Column type | Active phase | I | Reference | Comment |
---|---|---|---|---|
Capillary | HP-5 MS | 2548. | Grzeszczuk, Wesolowska, et al., 2011 | 30. m/0.25 mm/0.25 μm, Helium; Program: 40 0C (5 min) 30 0C/min -> 60 0C 6 0C/min -> 230 0C (10 min) |

References

Anonymous, 1968
Anonymous, R.,
Properties of hydrocarbon of high molecular weight, Am. Pet. Inst. Res. Proj. 42, Penn. State Univ., 1968. [all data]
Foehr and Fenske, 1949
Foehr, E.G.; Fenske, M.R.,
Magneto-optic Rotation of Hydrocarbons,
Ind. Eng. Chem., 1949, 41, 1956. [all data]
Schiessler, 1947
Schiessler, R.W.,
, Am. Pet. Inst. Res. Proj. 42, Twelfth Meeting, 1947. [all data]
Stephenson and Malanowski, 1987
Stephenson, Richard M.; Malanowski, Stanislaw,
Handbook of the Thermodynamics of Organic Compounds, 1987, https://doi.org/10.1007/978-94-009-3173-2
. [all data]
Schiessler and Whitmore, 1955
Schiessler, R.W.; Whitmore, F.C.,
Properties of High Molecular Weight Hydrocarbons,
Ind. Eng. Chem., 1955, 47, 8, 1660-1665, https://doi.org/10.1021/ie50548a054
. [all data]