Hexadecanophenone
- Formula: C22H36O
- Molecular weight: 316.5206
- IUPAC Standard InChIKey: IIOLAWJMOGLOIB-UHFFFAOYSA-N
- CAS Registry Number: 6697-12-7
- Chemical structure:

Phase change data

Data compiled as indicated in comments:
BS - Robert L. Brown and Stephen E. Stein
TRC - Thermodynamics Research Center, NIST Boulder Laboratories, Chris Muzny director
Quantity | Value | Units | Method | Reference | Comment |
---|---|---|---|---|---|
Tfus | 332.2 | K | N/A | Boelhouwer, Nederbragt, et al., 1950 | Uncertainty assigned by TRC = 0.6 K; TRC |
Tfus | 324. | K | N/A | Krafft, 1886 | Uncertainty assigned by TRC = 3. K; TRC |
Reduced pressure boiling point
Tboil (K) | Pressure (bar) | Reference | Comment |
---|---|---|---|
521.2 | 0.016 | Aldrich Chemical Company Inc., 1990 | BS |

References

Boelhouwer, Nederbragt, et al., 1950
Boelhouwer, J.W.M.; Nederbragt, G.W.; Verberg, G.W.,
Viscosity data of organic liquids,
Appl. Sci. Res., Sect. A, 1950, 2, 249. [all data]
Krafft, 1886
Krafft, F.,
Several high molecular benzene derivative.,
Ber. Dtsch. Chem. Ges., 1886, 19, 2982. [all data]
Aldrich Chemical Company Inc., 1990
Aldrich Chemical Company Inc.,
Catalog Handbook of Fine Chemicals, Aldrich Chemical Company, Inc., Milwaukee WI, 1990, 1. [all data]