4-Methoxyphenol, TMS derivative
- Formula: C10H16O2Si
- Molecular weight: 196.3183
- IUPAC Standard InChIKey: TXFCNWLJGZXMHT-UHFFFAOYSA-N
- CAS Registry Number: 6689-38-9
- Chemical structure:
View 3d structure (requires JavaScript / HTML 5) - Other names: Silane, (4-methoxyphenoxy)trimethyl-; Silane, (p-methoxyphenoxy)trimethyl-; (p-Methoxyphenoxy)trimethylsilane; 4-Methoxy-1-(trimethylsiloxy)benzene; 4-Methoxy(trimethylsiloxy)benzene; 1-Methoxy-4-trimethylsilyloxybenzene; 4-Methoxy-1-trimethylsilyloxybenzene; 4-Methoxyphenol, TMS ether; 4-Methoxyphenol, trimethylsilyl ether; (4-Methoxyphenoxy)(trimethyl)silane

Van Den Dool and Kratz RI, non-polar column, temperature ramp

Column type | Active phase | I | Reference | Comment |
---|---|---|---|---|
Packed | OV-1 | 1271. | Mattsson and Petersson, 1977 | N2, Supelcoport, 4. K/min; Column length: 2. m; Tstart: 80. C; Tend: 240. C |

Van Den Dool and Kratz RI, non-polar column, custom temperature program

Column type | Active phase | I | Reference | Comment |
---|---|---|---|---|
Capillary | VF-5MS | 1296.3 | Tret'yakov, 2008 | 30. m/0.25 mm/0.25 μm, He; Program: Multi-step temperature program; T(initial)=60C; T(final)=270C |
Capillary | 5 % Phenyl methyl siloxane | 1283. | Zaikin, 2003 | Column length: 30. m; Column diameter: 0.19 mm; Program: 50 C to 120 C at 5 C/min; 120 C to 290 C at 12 C/min |

References

Mattsson and Petersson, 1977
Mattsson, M.; Petersson, G.,
Reference GLC Data for the Analysis of Phenolic Compounds as Trimethylsilyl Derivatives,
J. Chromatogr. Sci., 1977, 15, 12, 546-554, https://doi.org/10.1093/chromsci/15.12.546
. [all data]
Tret'yakov, 2008
Tret'yakov, K.V.,
Retention Data. NIST Mass Spectrometry Data Center., NIST Mass Spectrometry Data Center, 2008. [all data]
Zaikin, 2003
Zaikin, V.G.,
Personal Communication: Retention indices measured during the period 2001 to 2003, 2003. [all data]