1H-Indene, 2,3-dihydro-4,7-dimethyl-
- Formula: C11H14
- Molecular weight: 146.2289
- IUPAC Standard InChIKey: IWHKMCQFAMHMSX-UHFFFAOYSA-N
- CAS Registry Number: 6682-71-9
- Chemical structure:
View 3d structure (requires JavaScript / HTML 5) - Other names: Indan, 4,7-dimethyl-; 4,7-Dimethylindan; 2,3-Dihydro-4,7-dimethyl-1H-indene; 4,7-Dimethyl-(2,3-dihydroindene); 4,7-Dimethylindane

Van Den Dool and Kratz RI, non-polar column, temperature ramp

Column type | Active phase | I | Reference | Comment |
---|---|---|---|---|
Capillary | Petrocol DH | 1248. | White, Hackett, et al., 1992 | 100. m/0.25 mm/0.5 μm, He, 1. K/min; Tstart: 30. C; Tend: 220. C |

Normal alkane RI, non-polar column, temperature ramp

Column type | Active phase | I | Reference | Comment |
---|---|---|---|---|
Capillary | Petrocol DH | 1253. | Supelco, 2012 | 100. m/0.25 mm/0.50 μm, Helium, 20. C @ 15. min, 15. K/min, 220. C @ 30. min |

Lee's RI, non-polar column, temperature ramp

Column type | Active phase | I | Reference | Comment |
---|---|---|---|---|
Capillary | DB-5 | 202.26 | Wang, Fingas, et al., 1994 | 30. m/0.32 mm/0.25 μm, He, 50. C @ 2. min, 6. K/min; Tend: 300. C |

Phase change data

Data compiled as indicated in comments:
TRC - Thermodynamics Research Center, NIST Boulder Laboratories, Chris Muzny director
ALS - Hussein Y. Afeefy, Joel F. Liebman, and Stephen E. Stein
AC - William E. Acree, Jr., James S. Chickos
DH - Eugene S. Domalski and Elizabeth D. Hearing

Quantity Value Units Method Reference Comment
Ttriple272.630KN/ALee-Bechtold, Finke, et al., 1981Uncertainty assigned by TRC = 0.005 K; TRC
Quantity Value Units Method Reference Comment
Δvap58.29 ± 0.44kJ/molVOsborn and Scott, 1978ALS
Δvap58.3 ± 0.4kJ/molIP,EBOsborn and Scott, 1978, 2Based on data from 313. - 470. K.; AC

Enthalpy of vaporization

ΔvapH (kJ/mol) Temperature (K) Method Reference Comment
54.7328.A,IP,EBStephenson and Malanowski, 1987Based on data from 313. - 470. K. See also Osborn and Scott, 1978, 2.; AC
56.9328.A,IP,EBStephenson and Malanowski, 1987Based on data from 313. - 363. K. See also Osborn and Scott, 1978, 2.; AC
50.6432.A,IP,EBStephenson and Malanowski, 1987Based on data from 417. - 470. K. See also Osborn and Scott, 1978, 2.; AC

Enthalpy of fusion

ΔfusH (kJ/mol) Temperature (K) Reference Comment
13.517272.635Lee-Bechtold, Finke, et al., 1981, 2DH
13.52272.7Domalski and Hearing, 1996AC

In addition to the Thermodynamics Research Center (TRC) data available from this site, much more physical and chemical property data is available from the following TRC products:

References

White, Hackett, et al., 1992
White, C.M.; Hackett, J.; Anderson, R.R.; Kail, S.; Spock, P.S.,
Linear temperature programmed retention indices of gasoline range hydrocarbons and chlorinated hydrocarbons on cross-linked polydimethylsiloxane,
J. Hi. Res. Chromatogr., 1992, 15, 2, 105-120, https://doi.org/10.1002/jhrc.1240150211
. [all data]
Supelco, 2012
Supelco, CatalogNo. 24160-U,
Petrocol DH Columns. Catalog No. 24160-U, 2012, retrieved from http://www.sigmaaldrich.com/etc/medialib/docs/Supelco/Datasheet/1/w97949.Par.0001.File.tmp/w97949.pdf. [all data]
Wang, Fingas, et al., 1994
Wang, Z.; Fingas, M.; Li, K.,
Fractionation of a light crude oil and identification and quantitation of aliphatic, aromatic, and biomarker comopunds by GC-FID and GC-MS, Part II,
J. Chromatogr. Sci., 1994, 32, 9, 367-382, https://doi.org/10.1093/chromsci/32.9.367
. [all data]