Ethyl-2,3-Dichloropropionate
- Formula: C5H8Cl2O2
- Molecular weight: 171.022
- IUPAC Standard InChIKey: RNZPQAZETZXKCQ-UHFFFAOYSA-N
- CAS Registry Number: 668-21-3
- Chemical structure:
View 3d structure (requires JavaScript / HTML 5) - Species with the same structure:
- Other names: Ethyl 2,3-dichloropropanoate

Van Den Dool and Kratz RI, non-polar column, custom temperature program

Column type | Active phase | I | Reference | Comment |
---|---|---|---|---|
Capillary | VF-5MS | 1022. | Tretyakov, 2011 | 30. m/0.25 mm/0.25 μm, He; Program: Multi-step temperature program; T(initial)=60C; T(final)=270C |

References

Tretyakov, 2011
Tretyakov, K.V.,
Retention Data. NIST Mass Spectrometry Data Center., NIST Mass Spectrometry Data Center, 2011. [all data]