2,4,4-trimethyl-3-hexanol

Phase change data

Data compiled by: Thermodynamics Research Center, NIST Boulder Laboratories, Chris Muzny director

Quantity Value Units Method Reference Comment
Tboil445.15KN/AConant, Webb, et al., 1929Uncertainty assigned by TRC = 6. K
Tboil443.65KN/AHaller and Bauer, 1913Uncertainty assigned by TRC = 4. K

In addition to the Thermodynamics Research Center (TRC) data available from this site, much more physical and chemical property data is available from the following TRC products:

References

Conant, Webb, et al., 1929
Conant, J.B.; Webb, C.N.; Mendum, W.C., Trimethylacetaldehyde and dimethylethylacetaldehyde, J. Am. Chem. Soc., 1929, 51, 1246. [all data]

Haller and Bauer, 1913
Haller, A.; Bauer, E., Ann. Chim. (Paris), 1913, 29, 8, 313. [all data]